{"text_format":"3","workbook":"xlsx","n_sheets":13,"sheets":["Instruction Sheet","Price Sheet","Order Form","Lists","Summary Sheet","ClassicData","ClassicBreakdown","BuckleData","BuckleBreakdown","Go-In! & Fast Eddie Package BD","Go-In! & Fast Eddie Data","Go-In! & Fast Eddie Buckle BD","Go-In! & Fast Eddie Buckle Data"],"not_rendered":{"images":14,"macros":1,"defined_names":27},"read":"whole","date_system":"1900"}

{"sheet":"Instruction Sheet","index":0,"n_rows":97,"n_cols":15,"rows_kept":97,"merged":[[54,1,54,10],[65,1,65,3],[65,5,65,8],[65,10,65,12]]}
[]
[]
[]
[{"$nulls":7},"ORDER ENTRY FORM INSTRUCTIONS "]
[]
[]
["NOTE: This is a template form, so please save a copy that can be reused.  Please do not reuse the template for multiple orders."]
[]
["Order Entry Instructions"]
[]
["Before you can enter data, please click the box under the Tool Bar titled \"Enabled Editing\" and/or \"Enable Content\"."]
[]
[]
[]
["Order Information / Billing / Shipping / Payment "]
["Please enter all applicable information."]
[]
[]
["Drop Down Boxes",null,"(Very Important)"]
[]
["Any cell that has a drop down arrow must be double clicked in the center of the cell. "]
[]
["Do not click the arrow, othwerwise the display will be very small."]
{"$rows_empty":18}
["Price Level"]
["Price Levels only apply to etched or color printed logos. All other customization methods are priced based on quantity per order."]
["Please refer to the \"Price Sheet\" tab for a complete breakdown of our pricing incentives for bulk quantities. "]
["Lock in your pricing for all future orders.   We grandfather all prior purchases when computing your current volume discount on each successive order."]
[]
["Example:  You place an order for your Annual Invitational Golf Tournament - 200 belts. This quantity puts you into price level 4."]
[null,"Your next order, no matter the quantity of that next order, will start at Price Level 4.  Depending on the number of items purchased"]
[null,"that order may elevate the Price Level again."]
[]
["Please remember to enter your price level before choosing your product, the price level will default to Price Level 1 if left blank.",{"$nulls":13},"Price Level"]
["The Price Level selection can be found in the top left section of the form, just below the \"Payment Information\" section.",{"$nulls":13},4]
[]
["Building Your Package"]
["Step 1","Choose Either Complete Packages, Buckles Only, Separate Straps, or Custom Hampton Ribbon Belt"]
[null,"Complete Packages Include Buckle and Strap",{"$nulls":4},"*To order separate straps, under \"Customization\" - choose \"Strap Only\", then select your strap and QTY."]
[]
["Step 2","Identify Logo To Be Used"]
[null,"Enter the description of which logo will be used (best if logo file name matches description)"]
["Step 3","Choose Your Customization Method"]
[null,"Etched - Laser Etched Logo ",{"$nulls":7},"Embossed - Raised Logo - MOQ 100 pieces per order."]
[null,"Color Print - Full Color Logo",{"$nulls":7},"Debossed - Stamped / Impressed Logo - MOQ 100 pieces per order."]
[]
["Step 4","Choose Your Buckle"]
[null,"We have a variety of finishes and styles to choose from, buckle styles below - see order form for finish options:"]
[null,"Go-In! Buckles                         with Hidden Ball Marker* ",{"$nulls":3},"Fast Eddie Buckles with Hidden Ball Marker and Divot Tool / Bottle Opener* ",{"$nulls":4},"Classic Buckles                    perfect for Dress or Golf"]
[]
[]
[]
[]
[]
[]
["Step 5","Choose Where To Place Your Logo"]
[null,"You have the option of a Full Size logo in the center of the buckle, or a lower corner (right) with a reduced size logo for a subtle touch."]
["Step 6","Choose Your Strap"]
[null,"We have 10 different standard straps to choose from. Or you can choose from over 20 additional limited stock straps* (please call first for availability) "]
[]
[null,"Important Notice: A qty of 30+ pcs of any one strap requires call ahead confirmation"]
["Step 7","Choose Your Presentation Box"]
[null,"Finish your custom belts off with unique packaging options:"]
[null,"Polycarbonate Box (Standard)",{"$nulls":3},"Polycarbonate Box with Custom Logo Insert*",{"$nulls":4},"Satin Black Box with Custom Logo*"]
[]
[]
[]
[]
[{"$nulls":5},"       Wood Piano Box with Custom Logo*"]
[]
[]
[]
[]
[]
["Step 8","Customize Your Golf Accessories"]
[null,"If you choose a buckle that includes a ball marker or divot tool/bottle opener, you can customize it as well! "]
[null,"Either Etch or Color Print your logo for a lasting impression."]
[]
[]
[null,"* Additional charges apply for certain selections"]

{"sheet":"Price Sheet","index":1,"n_rows":142,"n_cols":11,"rows_kept":142,"merged":[[104,1,104,3]]}
[]
[]
[]
[]
[]
[]
[null,"Customization Selection and Price Sheet"]
[]
[null,"Please follow the step-by-step listing below to explore your customization options"]
[]
[null,"Customization Methods"]
[]
[null,"Etched / Color Printed",{"$nulls":3},"Lead Time 3 weeks "]
[]
[{"$nulls":3},"GOLF",null,null,"FAST EDDIE",null,null,"CLASSIC"]
[null,"QTY","Price Level","Per Pkg","MSRP",null,"Per Pkg","MSRP",null,"Per Pkg","MSRP"]
[null,"1-23",1,{"v":42,"d":"$42.00"},{"$f":"D17*2","v":{"v":84,"d":"$84.00"}},null,{"$f":"D17+2.5","v":{"v":44.5,"d":"$44.50"}},{"$f":"G17*2","v":{"v":89,"d":"$89.00"}},null,{"v":38,"d":"$38.00"},{"$f":"J17*2","v":{"v":76,"d":"$76.00"}}]
[null,"24-99",2,{"v":39,"d":"$39.00"},{"v":78,"d":"$78.00"},null,{"v":41.5,"d":"$41.50"},{"v":83,"d":"$83.00"},null,{"v":36,"d":"$36.00"},{"v":72,"d":"$72.00"}]
[null,"100-199",3,{"v":35,"d":"$35.00"},{"v":70,"d":"$70.00"},null,{"v":37.5,"d":"$37.50"},{"v":75,"d":"$75.00"},null,{"v":33,"d":"$33.00"},{"v":66,"d":"$66.00"}]
[null,"200-249",4,{"v":32,"d":"$32.00"},{"v":64,"d":"$64.00"},null,{"v":34.5,"d":"$34.50"},{"v":69,"d":"$69.00"},null,{"v":31,"d":"$31.00"},{"v":62,"d":"$62.00"}]
[null,"250-349",5,{"v":30,"d":"$30.00"},{"v":60,"d":"$60.00"},null,{"v":32.5,"d":"$32.50"},{"v":65,"d":"$65.00"},null,{"v":29,"d":"$29.00"},{"v":58,"d":"$58.00"}]
[null,"350 +",6,{"v":29,"d":"$29.00"},{"v":58,"d":"$58.00"},null,{"v":31.5,"d":"$31.50"},{"v":63,"d":"$63.00"},null,{"v":28,"d":"$28.00"},{"v":56,"d":"$56.00"}]
[]
[null,"Embossed  / Debossed",{"$nulls":3},"Lead Time 6-8 Weeks Plate Option 12 Weeks Full Buckle"]
[]
[{"$nulls":3},"GOLF",null,null,"FAST EDDIE",null,null,"CLASSIC"]
[null,"QTY",null,"Per Pkg","MSRP",null,"Per Pkg","MSRP",null,"Per Pkg","MSRP"]
[null,"50-199",null,{"v":51,"d":"$51.00"},{"$f":"D28*2","v":{"v":102,"d":"$102.00"}},null,{"v":53.5,"d":"$53.50"},{"v":107,"d":"$107.00"},null,{"v":49,"d":"$49.00"},{"v":98,"d":"$98.00"}]
[null,"200-249",null,{"v":47,"d":"$47.00"},{"$f":"D29*2","v":{"v":94,"d":"$94.00"}},null,{"v":49.5,"d":"$49.50"},{"v":99,"d":"$99.00"},null,{"v":45,"d":"$45.00"},{"v":90,"d":"$90.00"}]
[null,"250-349",null,{"v":42,"d":"$42.00"},{"v":84,"d":"$84.00"},null,{"v":44.5,"d":"$44.50"},{"v":89,"d":"$89.00"},null,{"v":40,"d":"$40.00"},{"v":80,"d":"$80.00"}]
[null,"350+",null,{"v":40,"d":"$40.00"},{"v":80,"d":"$80.00"},null,{"v":42.5,"d":"$42.50"},{"v":85,"d":"$85.00"},null,{"v":38,"d":"$38.00"},{"v":76,"d":"$76.00"}]
[]
[null,"Buckles Only"]
[]
[{"$nulls":6},"Etched / Color Printed"]
[{"$nulls":3},"GOLF",null,null,"FAST EDDIE",null,null,"CLASSIC"]
[null,"QTY","Price Level","Per Pkg","MSRP",null,"Per Pkg","MSRP",null,"Per Pkg","MSRP"]
[null,"1-23",1,{"v":22,"d":"$22.00"},{"v":44,"d":"$44.00"},null,{"v":24.5,"d":"$24.50"},{"v":45,"d":"$45.00"},null,{"v":18,"d":"$18.00"},{"v":36,"d":"$36.00"}]
[null,"24-99",2,{"v":20,"d":"$20.00"},{"v":40,"d":"$40.00"},null,{"v":22.5,"d":"$22.50"},{"v":45,"d":"$45.00"},null,{"v":17,"d":"$17.00"},{"v":34,"d":"$34.00"}]
[null,"100-199",3,{"v":18,"d":"$18.00"},{"v":36,"d":"$36.00"},null,{"v":20.5,"d":"$20.50"},{"v":41,"d":"$41.00"},null,{"v":16,"d":"$16.00"},{"v":32,"d":"$32.00"}]
[null,"200-249",4,{"v":16,"d":"$16.00"},{"v":32,"d":"$32.00"},null,{"v":18.5,"d":"$18.50"},{"v":37,"d":"$37.00"},null,{"v":15,"d":"$15.00"},{"v":30,"d":"$30.00"}]
[null,"250-349",5,{"v":14,"d":"$14.00"},{"v":28,"d":"$28.00"},null,{"v":16.5,"d":"$16.50"},{"v":33,"d":"$33.00"},null,{"v":13,"d":"$13.00"},{"v":26,"d":"$26.00"}]
[null,"350 +",6,{"v":12,"d":"$12.00"},{"v":24,"d":"$24.00"},null,{"v":14.5,"d":"$14.50"},{"v":29,"d":"$29.00"},null,{"v":11,"d":"$11.00"},{"v":22,"d":"$22.00"}]
[]
[{"$nulls":6},"  Embossed / Debossed"]
[]
[{"$nulls":3},"GOLF",null,null,"FAST EDDIE",null,null,"CLASSIC"]
[null,"QTY",null,"Per Pkg","MSRP",null,"Per Pkg","MSRP",null,"Per Pkg","MSRP"]
[null,"50-199",null,{"v":31,"d":"$31.00"},{"v":62,"d":"$62.00"},null,{"v":33.5,"d":"$33.50"},{"v":67,"d":"$67.00"},null,{"v":29,"d":"$29.00"},{"v":58,"d":"$58.00"}]
[null,"200-249",null,{"v":27,"d":"$27.00"},{"v":54,"d":"$54.00"},null,{"v":29.5,"d":"$29.50"},{"v":59,"d":"$59.00"},null,{"v":25,"d":"$25.00"},{"v":50,"d":"$50.00"}]
[null,"250-349",null,{"v":22,"d":"$22.00"},{"v":44,"d":"$44.00"},null,{"v":24.5,"d":"$24.50"},{"v":49,"d":"$49.00"},null,{"v":20,"d":"$20.00"},{"v":40,"d":"$40.00"}]
[null,"350+",null,{"v":20,"d":"$20.00"},{"v":40,"d":"$40.00"},null,{"v":22.5,"d":"$22.50"},{"v":45,"d":"$45.00"},null,{"v":18,"d":"$18.00"},{"v":36,"d":"$36.00"}]
[]
[null,"Ribbon Belt w/ Aldrich Buckle",{"$nulls":3},"Lead Time 8-10 weeks / MOQ 50"]
[]
[null,null,"Hampton Ribbon Belt w/ Aldrich Buckle"]
[null,"QTY",null,"Per Pkg","MSRP"]
[null,"50-99",null,{"v":35,"d":"$35.00"},{"v":70,"d":"$70.00"}]
[null,"100-199",null,{"v":30,"d":"$30.00"},{"$f":"D59*2","v":{"v":60,"d":"$60.00"}}]
[null,"200-299",null,{"v":28,"d":"$28.00"},{"$f":"D60*2","v":{"v":56,"d":"$56.00"}}]
[null,"300-399",null,{"v":26,"d":"$26.00"},{"v":52,"d":"$52.00"}]
[null,"400-499",null,{"v":24,"d":"$24.00"},{"v":48,"d":"$48.00"}]
[]
[]
[]
[null,"Buckles"]
[]
[null,"Golf",{"$nulls":3},"Includes Regular Nexbelt Ball Marker (custom ball marker add $3.00)"]
[]
[null,"(BGG5406) Go-In! Gunmetal Beveled",{"$nulls":4},"(BGG5383) Go-In! Stealth Beveled"]
[null,"(BGG4508) Go-In! Brushed Nickel Beveled",{"$nulls":4},"(BGG7462) Go-In! Satin Nickel  NEW!"]
[]
[]
[null,"Fast Eddie",{"$nulls":3},"Includes Ball Marker, Divot Tool and Bottle Opener (custom ball marker add $3, custom divot tool add $3)"]
[]
[null,"(BGF4591) Fast Eddie Matte Nickel Beveled"]
[]
[null,"Classic"]
[]
[null,"(BCE5413) Classic Gunmetal Beveled",{"$nulls":4},"(BCE5963) Eagle White (Color Print Only)"]
[null,"(BCE4485) Classic Brushed Nickel Beveled",{"$nulls":4},"(BCE5956) Eagle Black (Color Print Only)"]
[null,"(BCE5390) Classic Stealth Beveled"]
[null,"(BCE5949) Classic Aston Black"]
[null,"(BCE5970) Classic Aston Pewter"]
[]
[]
[null,"Straps"]
[]
[null,"Important Notice: A qty of 30+ pcs of any one strap requires call ahead confirmation"]
[]
[null,"Standard "]
[]
[null,"(SEL0869) Smooth Black",{"$nulls":3},"(SEL0906) Smooth White",{"$nulls":4},"(SBC7745) Braided Charcoal 2.0 NEW!"]
[null,"(SEL0760) Carbon Black",{"$nulls":3},"(SCL3617) Deep Sea Navy Pebble Grain"]
[null,"(SEL4683) Espresso",{"$nulls":3},"(SCL3723) Smoke Grey Pebble Grain"]
[null,"(SEL0753) Walnut Brown",{"$nulls":3},"(SCL1422) Storm Grey Pebble Grain"]
[]
[null,"Upgraded Strap (add $15.00 per belt) "]
[]
[null,"(SAL0913) Alligator Black"]
[null,"(SAL3747) Alligator Coffee "]
[]
[null,"Canvas Strap  (subtract $5.00 per belt) "]
[]
[null,"(SNC1385) Newport Navy"]
[null,"(SNC1354) Newport Black",{"$nulls":3},"(SNC1361) Newport Grey"]
[]
[]
[null,"Presentation Boxes"]
[]
[null,"Description",{"$nulls":7},"Per Pkg","MAP"]
[null,"Poly-Carbonate Box",{"$nulls":7},"Included","Included"]
[null,"Tournament Packaging",{"$nulls":7},{"v":1,"d":"$1.00"},{"v":2,"d":"$2.00"}]
[null,"Tournament Packaging w/ Logo",{"$nulls":7},{"v":1,"d":"$1.00"},{"v":2,"d":"$2.00"}]
[null,"Velvet Bag",{"$nulls":7},{"v":1,"d":"$1.00"},{"v":2,"d":"$2.00"}]
[null,"Poly-Carbonate Box with Custom Logo Insert",{"$nulls":7},{"v":2,"d":"$2.00"},{"v":4,"d":"$4.00"}]
[null,"Satin Black Jewel Box with Custom Logo on Top of the Box",{"$nulls":7},{"v":6,"d":"$6.00"},{"v":12,"d":"$12.00"}]
[null,"Satin Black Jewel Box with Custom Logo on Top and Inside of the Box",{"$nulls":7},{"v":8,"d":"$8.00"},{"v":16,"d":"$16.00"}]
[null,"Piano Black Wooden Box with Custom Logo Inside of the Box",{"$nulls":7},{"v":25,"d":"$25.00"},{"v":50,"d":"$50.00"}]
[]
[null,"Ball Markers (Golf and Fast Eddie buckles)"]
[]
[null,"Description",{"$nulls":7},"Per Pkg","MSRP"]
[null,"Standard Ball Marker",{"$nulls":7},"Included","Included"]
[null,"Custom Ball Marker with Etched Logo",{"$nulls":7},{"v":3,"d":"$3.00"},{"v":6,"d":"$6.00"}]
[null,"Color Printed Logo Ball Marker ",{"$nulls":7},{"v":3,"d":"$3.00"},{"v":6,"d":"$6.00"}]
[]
[null,"Custom Extras"]
[]
[null,"Description",{"$nulls":7},"Per Pkg","MSRP"]
[null,"Divit Tool Etching",{"$nulls":7},{"v":3,"d":"$3.00"},{"v":6,"d":"$6.00"}]
[]
[]
[null,"Special Terms"]
[]
[null,"A 50% deposit is required on all custom orders"]
[]
[null,"Any custom order over $5,000.00 may require 50% deposit."]
[]
[null,"RUSH ORDERS: There is a $150 Rush Fee for etched/color print orders with Ship Dates shorter than our stated lead times."]
[null,null,"         There is a $250 Rush Fee for custom ribbon belt orders with Ship Dates shorter than our stated lead times."]
[null,"Workspace For Notes "]

{"sheet":"Order Form","index":2,"n_rows":99,"n_cols":24,"rows_kept":99,"merged":[[0,3,3,6],[7,1,7,2],[7,3,7,6],[7,8,7,9],[8,1,8,2],[8,3,8,6],[9,1,9,2],[9,3,9,6],[12,3,12,7],[13,3,13,6],[14,3,14,5],[15,3,15,5],[15,7,15,8],[16,3,16,5],[19,3,19,9],[20,3,20,9],[21,3,21,5],[22,3,22,5],[22,7,22,8],[23,3,23,5],[26,3,26,4],[26,7,26,8],[27,3,27,4],[27,7,27,8],[28,3,28,4],[28,7,28,8],[71,1,71,3],[71,5,74,8],[72,1,72,3],[73,1,73,3],[74,1,74,3],[77,1,77,8],[78,1,78,8],[79,1,79,8],[80,1,80,8]]}
[{"$nulls":3},"Custom Order Form"]
[{"$nulls":9},"10390 Regis Court"]
[{"$nulls":9},"Rancho Cucamonga, CA  91730"]
[{"$nulls":9},"Phone: 909-758-0079  Fax: 866-610-4573"]
[{"$nulls":9},"Rev. January  19th, 2021"]
[]
[null,"Order Information"]
[null,"Order Date:",{"$nulls":6},"Shipping Window"]
[null,"Customer PO:",{"$nulls":6},"From:"]
[null,"Rep Name:",{"$nulls":6},"To:"]
[]
[null,"Billing Information"]
[null,null,"Customer Name:",{"$nulls":5},"Member #:"]
[null,null,"Address:"]
[null,null,"City:",{"$nulls":3},"State:",null,"Zip:"]
[null,null,"Contact:",{"$nulls":3},"Phone:"]
[null,null,"Email:"]
[]
[null,"Shipping Information"]
[null,null,"Customer Name:","Same as Billing information above"]
[null,null,"Address:"]
[null,null,"City:",{"$nulls":3},"State:",null,"Zip:"]
[null,null,"Contact:",{"$nulls":3},"Phone:"]
[null,null,"Email:"]
[]
[null,"Payment Information"]
[null,null,"Credit Card:",{"$nulls":3},"Card Type:"]
[null,null,"Name on Card:",{"$nulls":3},"Zip:"]
[null,null,"Exp Date:",{"$nulls":3},"CVV:"]
[null,"Price Level","Qty"]
[{"$f":"IFERROR(VLOOKUP(B31,F94:G99,2,FALSE),1)","v":1},"#1",{"$f":"IFERROR(VLOOKUP(B31,ClassicData!AJ:AK,2,FALSE),\"\")","v":"1-23"}]
[null,null,"Order Complete Packages Below:"]
["Logo Description","Customization","Buckle","Logo Placement","Strap","Presentation Box","Ball Mark / Tool","Price Ea.","Qty","Total","Base Charge","Buckle Adjust","Strap Adjust","Box Adjust","CapCharge","BM/Tool Adjust","Embossed Buckle Adjust","Debossed Buckle Adjust","Color Print Buckle Adjust","Etched Buckle Adjust","Fast Eddie","Go-In!","Classic","Strap Only Adjust"]
[{"$nulls":7},{"$f":"IF(K34=\"Less Than MOQ\",K34,IF(ISBLANK(B34),X34,SUM(K34:P34,X34)))","v":{"v":0,"d":"$0.00"}},null,{"$f":"I34*H34","v":{"v":0,"d":"$0.00"}},{"$f":"IFERROR(IF(B34=ClassicBreakdown!$B$7,ClassicBreakdown!$G$5,IF('Order Form'!B34=ClassicBreakdown!$C$7,ClassicBreakdown!$G$5,IF('Order Form'!B34=ClassicBreakdown!$J$8,ClassicBreakdown!$L$7,IF('Order Form'!B34=ClassicBreakdown!$B$33,ClassicBreakdown!$D$32,IF('Order Form'!B34=ClassicBreakdown!$J$31,ClassicBreakdown!$L$30,IF('Order Form'!B34=ClassicBreakdown!$O$8,ClassicBreakdown!$Q$7,0)))))),\"MOQ\")","v":{"v":0,"d":"$0.00"}},{"$f":"IF(B34=\"Etched\",T34,IF(B34=\"Color Print\",S34,IF(B34=\"Embossed\",Q34,IF(B34=\"Debossed\",R34,IF(B34=\"Polished Plate\",#REF!,0)))))","v":{"v":0,"d":"$0.00"}},{"$f":"IF(ISBLANK(E34),0,IF(B34=\"Strap Only\",0,VLOOKUP(E34,ClassicData!$U:$V,2,FALSE)))","v":{"v":0,"d":"$0.00"}},{"$f":"IF(ISBLANK(F34),0,VLOOKUP(F34,ClassicData!$Y:$Z,2,FALSE))","v":{"v":0,"d":"$0.00"}},{"$f":"(IF(ISBLANK(B34),0,IF(LEFT(B34,9)=\"CustomCap\",CapPrice,0)))","v":{"v":0,"d":"$0.00"}},{"$f":"IF(ISBLANK(G34),0,VLOOKUP(G34,ClassicData!$AB:$AC,2,FALSE))","v":{"v":0,"d":"$0.00"}},{"$f":"IF(U34=1,4.5,IF(V34=1,2,0))","v":{"v":0,"d":"$0.00"}},{"$f":"IF(U34=1,4.5,IF(V34=1,2,0))","v":{"v":0,"d":"$0.00"}},{"$f":"IF(ISBLANK(C34),0,IF(U34=1,'Go-In! & Fast Eddie Package BD'!$G$32,IF('Order Form'!V34=1,'Go-In! & Fast Eddie Package BD'!$G$4,IF('Order Form'!W34=1,0,0))))","v":{"v":0,"d":"$0.00"}},{"$f":"IF(ISBLANK(C34),0,IF(U34=1,'Go-In! & Fast Eddie Package BD'!$G$32,IF('Order Form'!V34=1,'Go-In! & Fast Eddie Package BD'!$G$4,IF('Order Form'!W34=1,0,0))))","v":{"v":0,"d":"$0.00"}},{"$f":"IFERROR(IF(SEARCH(\"Fast Eddie\",C34,1),1),0)","v":0},{"$f":"IFERROR(IF(SEARCH(\"Go-In!\",C34,1),1),0)","v":0},{"$f":"IFERROR(IF(SEARCH(\"Classic\",C34,1),1),0)","v":0},{"$f":"(IF(ISBLANK(E34),0,IF(B34=\"StrapOnly\",VLOOKUP(E34,ClassicData!$AF:$AG,2,FALSE))))","v":0}]
[{"$nulls":7},{"v":0,"d":"$0.00"},null,{"$f":"I35*H35","v":{"v":0,"d":"$0.00"}},{"$f":"IFERROR(IF(B35=ClassicBreakdown!$B$7,ClassicBreakdown!$G$5,IF('Order Form'!B35=ClassicBreakdown!$C$7,ClassicBreakdown!$G$5,IF('Order Form'!B35=ClassicBreakdown!$J$8,ClassicBreakdown!$L$7,IF('Order Form'!B35=ClassicBreakdown!$B$33,ClassicBreakdown!$D$32,IF('Order Form'!B35=ClassicBreakdown!$J$31,ClassicBreakdown!$L$30,IF('Order Form'!B35=ClassicBreakdown!$O$8,ClassicBreakdown!$Q$7,0)))))),\"MOQ\")","v":{"v":0,"d":"$0.00"}},{"$f":"IF(B35=\"Etched\",T35,IF(B35=\"Color Print\",S35,IF(B35=\"Embossed\",Q35,IF(B35=\"Debossed\",R35,IF(B35=\"Polished Plate\",#REF!,0)))))","v":{"v":0,"d":"$0.00"}},{"$f":"IF(ISBLANK(E35),0,IF(B35=\"Strap Only\",0,VLOOKUP(E35,ClassicData!$U:$V,2,FALSE)))","v":{"v":0,"d":"$0.00"}},{"$f":"IF(ISBLANK(F35),0,VLOOKUP(F35,ClassicData!$Y:$Z,2,FALSE))","v":{"v":0,"d":"$0.00"}},{"v":0,"d":"$0.00"},{"$f":"IF(ISBLANK(G35),0,VLOOKUP(G35,ClassicData!$AB:$AC,2,FALSE))","v":{"v":0,"d":"$0.00"}},{"$f":"IF(U35=1,4.5,IF(V35=1,2,0))","v":{"v":0,"d":"$0.00"}},{"$f":"IF(U35=1,4.5,IF(V35=1,2,0))","v":{"v":0,"d":"$0.00"}},{"$f":"IF(ISBLANK(C35),0,IF(U35=1,'Go-In! & Fast Eddie Package BD'!$G$32,IF('Order Form'!V35=1,'Go-In! & Fast Eddie Package BD'!$G$4,IF('Order Form'!W35=1,0,0))))","v":{"v":0,"d":"$0.00"}},{"$f":"IF(ISBLANK(C35),0,IF(U35=1,'Go-In! & Fast Eddie Package BD'!$G$32,IF('Order Form'!V35=1,'Go-In! & Fast Eddie Package BD'!$G$4,IF('Order Form'!W35=1,0,0))))","v":{"v":0,"d":"$0.00"}},0,0,0,{"$f":"(IF(ISBLANK(E35),0,IF(B35=\"StrapOnly\",VLOOKUP(E35,ClassicData!$AF:$AG,2,FALSE))))","v":0}]
[{"$nulls":7},{"v":0,"d":"$0.00"},null,{"v":0,"d":"$0.00"},{"$f":"IFERROR(IF(B36=ClassicBreakdown!$B$7,ClassicBreakdown!$G$5,IF('Order Form'!B36=ClassicBreakdown!$C$7,ClassicBreakdown!$G$5,IF('Order Form'!B36=ClassicBreakdown!$J$8,ClassicBreakdown!$L$7,IF('Order Form'!B36=ClassicBreakdown!$B$33,ClassicBreakdown!$D$32,IF('Order Form'!B36=ClassicBreakdown!$J$31,ClassicBreakdown!$L$30,IF('Order Form'!B36=ClassicBreakdown!$O$8,ClassicBreakdown!$Q$7,0)))))),\"MOQ\")","v":{"v":0,"d":"$0.00"}},{"$f":"IF(B36=\"Etched\",T36,IF(B36=\"Color Print\",S36,IF(B36=\"Embossed\",Q36,IF(B36=\"Debossed\",R36,IF(B36=\"Polished Plate\",#REF!,0)))))","v":{"v":0,"d":"$0.00"}},{"$f":"IF(ISBLANK(E36),0,IF(B36=\"Strap Only\",0,VLOOKUP(E36,ClassicData!$U:$V,2,FALSE)))","v":{"v":0,"d":"$0.00"}},{"$f":"IF(ISBLANK(F36),0,VLOOKUP(F36,ClassicData!$Y:$Z,2,FALSE))","v":{"v":0,"d":"$0.00"}},{"v":0,"d":"$0.00"},{"$f":"IF(ISBLANK(G36),0,VLOOKUP(G36,ClassicData!$AB:$AC,2,FALSE))","v":{"v":0,"d":"$0.00"}},{"v":0,"d":"$0.00"},{"v":0,"d":"$0.00"},{"$f":"IF(ISBLANK(C36),0,IF(U36=1,'Go-In! & Fast Eddie Package BD'!$G$32,IF('Order Form'!V36=1,'Go-In! & Fast Eddie Package BD'!$G$4,IF('Order Form'!W36=1,0,0))))","v":{"v":0,"d":"$0.00"}},{"$f":"IF(ISBLANK(C36),0,IF(U36=1,'Go-In! & Fast Eddie Package BD'!$G$32,IF('Order Form'!V36=1,'Go-In! & Fast Eddie Package BD'!$G$4,IF('Order Form'!W36=1,0,0))))","v":{"v":0,"d":"$0.00"}},0,0,0,{"$f":"(IF(ISBLANK(E36),0,IF(B36=\"StrapOnly\",VLOOKUP(E36,ClassicData!$AF:$AG,2,FALSE))))","v":0}]
[{"$nulls":7},{"v":0,"d":"$0.00"},null,{"v":0,"d":"$0.00"},{"$f":"IFERROR(IF(B37=ClassicBreakdown!$B$7,ClassicBreakdown!$G$5,IF('Order Form'!B37=ClassicBreakdown!$C$7,ClassicBreakdown!$G$5,IF('Order Form'!B37=ClassicBreakdown!$J$8,ClassicBreakdown!$L$7,IF('Order Form'!B37=ClassicBreakdown!$B$33,ClassicBreakdown!$D$32,IF('Order Form'!B37=ClassicBreakdown!$J$31,ClassicBreakdown!$L$30,IF('Order Form'!B37=ClassicBreakdown!$O$8,ClassicBreakdown!$Q$7,0)))))),\"MOQ\")","v":{"v":0,"d":"$0.00"}},{"$f":"IF(B37=\"Etched\",T37,IF(B37=\"Color Print\",S37,IF(B37=\"Embossed\",Q37,IF(B37=\"Debossed\",R37,IF(B37=\"Polished Plate\",#REF!,0)))))","v":{"v":0,"d":"$0.00"}},{"$f":"IF(ISBLANK(E37),0,IF(B37=\"Strap Only\",0,VLOOKUP(E37,ClassicData!$U:$V,2,FALSE)))","v":{"v":0,"d":"$0.00"}},{"$f":"IF(ISBLANK(F37),0,VLOOKUP(F37,ClassicData!$Y:$Z,2,FALSE))","v":{"v":0,"d":"$0.00"}},{"v":0,"d":"$0.00"},{"$f":"IF(ISBLANK(G37),0,VLOOKUP(G37,ClassicData!$AB:$AC,2,FALSE))","v":{"v":0,"d":"$0.00"}},{"v":0,"d":"$0.00"},{"v":0,"d":"$0.00"},{"$f":"IF(ISBLANK(C37),0,IF(U37=1,'Go-In! & Fast Eddie Package BD'!$G$32,IF('Order Form'!V37=1,'Go-In! & Fast Eddie Package BD'!$G$4,IF('Order Form'!W37=1,0,0))))","v":{"v":0,"d":"$0.00"}},{"$f":"IF(ISBLANK(C37),0,IF(U37=1,'Go-In! & Fast Eddie Package BD'!$G$32,IF('Order Form'!V37=1,'Go-In! & Fast Eddie Package BD'!$G$4,IF('Order Form'!W37=1,0,0))))","v":{"v":0,"d":"$0.00"}},0,0,0,{"$f":"(IF(ISBLANK(E37),0,IF(B37=\"StrapOnly\",VLOOKUP(E37,ClassicData!$AF:$AG,2,FALSE))))","v":0}]
[{"$nulls":7},{"v":0,"d":"$0.00"},null,{"v":0,"d":"$0.00"},{"$f":"IFERROR(IF(B38=ClassicBreakdown!$B$7,ClassicBreakdown!$G$5,IF('Order Form'!B38=ClassicBreakdown!$C$7,ClassicBreakdown!$G$5,IF('Order Form'!B38=ClassicBreakdown!$J$8,ClassicBreakdown!$L$7,IF('Order Form'!B38=ClassicBreakdown!$B$33,ClassicBreakdown!$D$32,IF('Order Form'!B38=ClassicBreakdown!$J$31,ClassicBreakdown!$L$30,IF('Order Form'!B38=ClassicBreakdown!$O$8,ClassicBreakdown!$Q$7,0)))))),\"MOQ\")","v":{"v":0,"d":"$0.00"}},{"$f":"IF(B38=\"Etched\",T38,IF(B38=\"Color Print\",S38,IF(B38=\"Embossed\",Q38,IF(B38=\"Debossed\",R38,IF(B38=\"Polished Plate\",#REF!,0)))))","v":{"v":0,"d":"$0.00"}},{"$f":"IF(ISBLANK(E38),0,IF(B38=\"Strap Only\",0,VLOOKUP(E38,ClassicData!$U:$V,2,FALSE)))","v":{"v":0,"d":"$0.00"}},{"$f":"IF(ISBLANK(F38),0,VLOOKUP(F38,ClassicData!$Y:$Z,2,FALSE))","v":{"v":0,"d":"$0.00"}},{"v":0,"d":"$0.00"},{"$f":"IF(ISBLANK(G38),0,VLOOKUP(G38,ClassicData!$AB:$AC,2,FALSE))","v":{"v":0,"d":"$0.00"}},{"v":0,"d":"$0.00"},{"v":0,"d":"$0.00"},{"$f":"IF(ISBLANK(C38),0,IF(U38=1,'Go-In! & Fast Eddie Package BD'!$G$32,IF('Order Form'!V38=1,'Go-In! & Fast Eddie Package BD'!$G$4,IF('Order Form'!W38=1,0,0))))","v":{"v":0,"d":"$0.00"}},{"$f":"IF(ISBLANK(C38),0,IF(U38=1,'Go-In! & Fast Eddie Package BD'!$G$32,IF('Order Form'!V38=1,'Go-In! & Fast Eddie Package BD'!$G$4,IF('Order Form'!W38=1,0,0))))","v":{"v":0,"d":"$0.00"}},0,0,0,{"$f":"(IF(ISBLANK(E38),0,IF(B38=\"StrapOnly\",VLOOKUP(E38,ClassicData!$AF:$AG,2,FALSE))))","v":0}]
[{"$nulls":7},{"v":0,"d":"$0.00"},null,{"v":0,"d":"$0.00"},{"$f":"IFERROR(IF(B39=ClassicBreakdown!$B$7,ClassicBreakdown!$G$5,IF('Order Form'!B39=ClassicBreakdown!$C$7,ClassicBreakdown!$G$5,IF('Order Form'!B39=ClassicBreakdown!$J$8,ClassicBreakdown!$L$7,IF('Order Form'!B39=ClassicBreakdown!$B$33,ClassicBreakdown!$D$32,IF('Order Form'!B39=ClassicBreakdown!$J$31,ClassicBreakdown!$L$30,IF('Order Form'!B39=ClassicBreakdown!$O$8,ClassicBreakdown!$Q$7,0)))))),\"MOQ\")","v":{"v":0,"d":"$0.00"}},{"$f":"IF(B39=\"Etched\",T39,IF(B39=\"Color Print\",S39,IF(B39=\"Embossed\",Q39,IF(B39=\"Debossed\",R39,IF(B39=\"Polished Plate\",#REF!,0)))))","v":{"v":0,"d":"$0.00"}},{"$f":"IF(ISBLANK(E39),0,IF(B39=\"Strap Only\",0,VLOOKUP(E39,ClassicData!$U:$V,2,FALSE)))","v":{"v":0,"d":"$0.00"}},{"$f":"IF(ISBLANK(F39),0,VLOOKUP(F39,ClassicData!$Y:$Z,2,FALSE))","v":{"v":0,"d":"$0.00"}},{"v":0,"d":"$0.00"},{"$f":"IF(ISBLANK(G39),0,VLOOKUP(G39,ClassicData!$AB:$AC,2,FALSE))","v":{"v":0,"d":"$0.00"}},{"v":0,"d":"$0.00"},{"v":0,"d":"$0.00"},{"$f":"IF(ISBLANK(C39),0,IF(U39=1,'Go-In! & Fast Eddie Package BD'!$G$32,IF('Order Form'!V39=1,'Go-In! & Fast Eddie Package BD'!$G$4,IF('Order Form'!W39=1,0,0))))","v":{"v":0,"d":"$0.00"}},{"$f":"IF(ISBLANK(C39),0,IF(U39=1,'Go-In! & Fast Eddie Package BD'!$G$32,IF('Order Form'!V39=1,'Go-In! & Fast Eddie Package BD'!$G$4,IF('Order Form'!W39=1,0,0))))","v":{"v":0,"d":"$0.00"}},0,0,0,{"$f":"(IF(ISBLANK(E39),0,IF(B39=\"StrapOnly\",VLOOKUP(E39,ClassicData!$AF:$AG,2,FALSE))))","v":0}]
[{"$nulls":7},{"v":0,"d":"$0.00"},null,{"v":0,"d":"$0.00"},{"$f":"IFERROR(IF(B40=ClassicBreakdown!$B$7,ClassicBreakdown!$G$5,IF('Order Form'!B40=ClassicBreakdown!$C$7,ClassicBreakdown!$G$5,IF('Order Form'!B40=ClassicBreakdown!$J$8,ClassicBreakdown!$L$7,IF('Order Form'!B40=ClassicBreakdown!$B$33,ClassicBreakdown!$D$32,IF('Order Form'!B40=ClassicBreakdown!$J$31,ClassicBreakdown!$L$30,IF('Order Form'!B40=ClassicBreakdown!$O$8,ClassicBreakdown!$Q$7,0)))))),\"MOQ\")","v":{"v":0,"d":"$0.00"}},{"$f":"IF(B40=\"Etched\",T40,IF(B40=\"Color Print\",S40,IF(B40=\"Embossed\",Q40,IF(B40=\"Debossed\",R40,IF(B40=\"Polished Plate\",#REF!,0)))))","v":{"v":0,"d":"$0.00"}},{"$f":"IF(ISBLANK(E40),0,IF(B40=\"Strap Only\",0,VLOOKUP(E40,ClassicData!$U:$V,2,FALSE)))","v":{"v":0,"d":"$0.00"}},{"$f":"IF(ISBLANK(F40),0,VLOOKUP(F40,ClassicData!$Y:$Z,2,FALSE))","v":{"v":0,"d":"$0.00"}},{"v":0,"d":"$0.00"},{"$f":"IF(ISBLANK(G40),0,VLOOKUP(G40,ClassicData!$AB:$AC,2,FALSE))","v":{"v":0,"d":"$0.00"}},{"v":0,"d":"$0.00"},{"v":0,"d":"$0.00"},{"$f":"IF(ISBLANK(C40),0,IF(U40=1,'Go-In! & Fast Eddie Package BD'!$G$32,IF('Order Form'!V40=1,'Go-In! & Fast Eddie Package BD'!$G$4,IF('Order Form'!W40=1,0,0))))","v":{"v":0,"d":"$0.00"}},{"$f":"IF(ISBLANK(C40),0,IF(U40=1,'Go-In! & Fast Eddie Package BD'!$G$32,IF('Order Form'!V40=1,'Go-In! & Fast Eddie Package BD'!$G$4,IF('Order Form'!W40=1,0,0))))","v":{"v":0,"d":"$0.00"}},0,0,0,{"$f":"(IF(ISBLANK(E40),0,IF(B40=\"StrapOnly\",VLOOKUP(E40,ClassicData!$AF:$AG,2,FALSE))))","v":0}]
[{"$nulls":7},{"v":0,"d":"$0.00"},null,{"v":0,"d":"$0.00"},{"$f":"IFERROR(IF(B41=ClassicBreakdown!$B$7,ClassicBreakdown!$G$5,IF('Order Form'!B41=ClassicBreakdown!$C$7,ClassicBreakdown!$G$5,IF('Order Form'!B41=ClassicBreakdown!$J$8,ClassicBreakdown!$L$7,IF('Order Form'!B41=ClassicBreakdown!$B$33,ClassicBreakdown!$D$32,IF('Order Form'!B41=ClassicBreakdown!$J$31,ClassicBreakdown!$L$30,IF('Order Form'!B41=ClassicBreakdown!$O$8,ClassicBreakdown!$Q$7,0)))))),\"MOQ\")","v":{"v":0,"d":"$0.00"}},{"$f":"IF(B41=\"Etched\",T41,IF(B41=\"Color Print\",S41,IF(B41=\"Embossed\",Q41,IF(B41=\"Debossed\",R41,IF(B41=\"Polished Plate\",#REF!,0)))))","v":{"v":0,"d":"$0.00"}},{"$f":"IF(ISBLANK(E41),0,IF(B41=\"Strap Only\",0,VLOOKUP(E41,ClassicData!$U:$V,2,FALSE)))","v":{"v":0,"d":"$0.00"}},{"$f":"IF(ISBLANK(F41),0,VLOOKUP(F41,ClassicData!$Y:$Z,2,FALSE))","v":{"v":0,"d":"$0.00"}},{"v":0,"d":"$0.00"},{"$f":"IF(ISBLANK(G41),0,VLOOKUP(G41,ClassicData!$AB:$AC,2,FALSE))","v":{"v":0,"d":"$0.00"}},{"v":0,"d":"$0.00"},{"v":0,"d":"$0.00"},{"$f":"IF(ISBLANK(C41),0,IF(U41=1,'Go-In! & Fast Eddie Package BD'!$G$32,IF('Order Form'!V41=1,'Go-In! & Fast Eddie Package BD'!$G$4,IF('Order Form'!W41=1,0,0))))","v":{"v":0,"d":"$0.00"}},{"$f":"IF(ISBLANK(C41),0,IF(U41=1,'Go-In! & Fast Eddie Package BD'!$G$32,IF('Order Form'!V41=1,'Go-In! & Fast Eddie Package BD'!$G$4,IF('Order Form'!W41=1,0,0))))","v":{"v":0,"d":"$0.00"}},0,0,0,{"$f":"(IF(ISBLANK(E41),0,IF(B41=\"StrapOnly\",VLOOKUP(E41,ClassicData!$AF:$AG,2,FALSE))))","v":0}]
[{"$nulls":7},{"v":0,"d":"$0.00"},null,{"v":0,"d":"$0.00"},{"$f":"IFERROR(IF(B42=ClassicBreakdown!$B$7,ClassicBreakdown!$G$5,IF('Order Form'!B42=ClassicBreakdown!$C$7,ClassicBreakdown!$G$5,IF('Order Form'!B42=ClassicBreakdown!$J$8,ClassicBreakdown!$L$7,IF('Order Form'!B42=ClassicBreakdown!$B$33,ClassicBreakdown!$D$32,IF('Order Form'!B42=ClassicBreakdown!$J$31,ClassicBreakdown!$L$30,IF('Order Form'!B42=ClassicBreakdown!$O$8,ClassicBreakdown!$Q$7,0)))))),\"MOQ\")","v":{"v":0,"d":"$0.00"}},{"$f":"IF(B42=\"Etched\",T42,IF(B42=\"Color Print\",S42,IF(B42=\"Embossed\",Q42,IF(B42=\"Debossed\",R42,IF(B42=\"Polished Plate\",#REF!,0)))))","v":{"v":0,"d":"$0.00"}},{"$f":"IF(ISBLANK(E42),0,IF(B42=\"Strap Only\",0,VLOOKUP(E42,ClassicData!$U:$V,2,FALSE)))","v":{"v":0,"d":"$0.00"}},{"$f":"IF(ISBLANK(F42),0,VLOOKUP(F42,ClassicData!$Y:$Z,2,FALSE))","v":{"v":0,"d":"$0.00"}},{"v":0,"d":"$0.00"},{"$f":"IF(ISBLANK(G42),0,VLOOKUP(G42,ClassicData!$AB:$AC,2,FALSE))","v":{"v":0,"d":"$0.00"}},{"v":0,"d":"$0.00"},{"v":0,"d":"$0.00"},{"$f":"IF(ISBLANK(C42),0,IF(U42=1,'Go-In! & Fast Eddie Package BD'!$G$32,IF('Order Form'!V42=1,'Go-In! & Fast Eddie Package BD'!$G$4,IF('Order Form'!W42=1,0,0))))","v":{"v":0,"d":"$0.00"}},{"$f":"IF(ISBLANK(C42),0,IF(U42=1,'Go-In! & Fast Eddie Package BD'!$G$32,IF('Order Form'!V42=1,'Go-In! & Fast Eddie Package BD'!$G$4,IF('Order Form'!W42=1,0,0))))","v":{"v":0,"d":"$0.00"}},0,0,0,{"$f":"(IF(ISBLANK(E42),0,IF(B42=\"StrapOnly\",VLOOKUP(E42,ClassicData!$AF:$AG,2,FALSE))))","v":0}]
[{"$nulls":7},{"v":0,"d":"$0.00"},null,{"v":0,"d":"$0.00"},{"$f":"IFERROR(IF(B43=ClassicBreakdown!$B$7,ClassicBreakdown!$G$5,IF('Order Form'!B43=ClassicBreakdown!$C$7,ClassicBreakdown!$G$5,IF('Order Form'!B43=ClassicBreakdown!$J$8,ClassicBreakdown!$L$7,IF('Order Form'!B43=ClassicBreakdown!$B$33,ClassicBreakdown!$D$32,IF('Order Form'!B43=ClassicBreakdown!$J$31,ClassicBreakdown!$L$30,IF('Order Form'!B43=ClassicBreakdown!$O$8,ClassicBreakdown!$Q$7,0)))))),\"MOQ\")","v":{"v":0,"d":"$0.00"}},{"$f":"IF(B43=\"Etched\",T43,IF(B43=\"Color Print\",S43,IF(B43=\"Embossed\",Q43,IF(B43=\"Debossed\",R43,IF(B43=\"Polished Plate\",#REF!,0)))))","v":{"v":0,"d":"$0.00"}},{"$f":"IF(ISBLANK(E43),0,IF(B43=\"Strap Only\",0,VLOOKUP(E43,ClassicData!$U:$V,2,FALSE)))","v":{"v":0,"d":"$0.00"}},{"$f":"IF(ISBLANK(F43),0,VLOOKUP(F43,ClassicData!$Y:$Z,2,FALSE))","v":{"v":0,"d":"$0.00"}},{"v":0,"d":"$0.00"},{"$f":"IF(ISBLANK(G43),0,VLOOKUP(G43,ClassicData!$AB:$AC,2,FALSE))","v":{"v":0,"d":"$0.00"}},{"v":0,"d":"$0.00"},{"v":0,"d":"$0.00"},{"$f":"IF(ISBLANK(C43),0,IF(U43=1,'Go-In! & Fast Eddie Package BD'!$G$32,IF('Order Form'!V43=1,'Go-In! & Fast Eddie Package BD'!$G$4,IF('Order Form'!W43=1,0,0))))","v":{"v":0,"d":"$0.00"}},{"$f":"IF(ISBLANK(C43),0,IF(U43=1,'Go-In! & Fast Eddie Package BD'!$G$32,IF('Order Form'!V43=1,'Go-In! & Fast Eddie Package BD'!$G$4,IF('Order Form'!W43=1,0,0))))","v":{"v":0,"d":"$0.00"}},0,0,0,{"$f":"(IF(ISBLANK(E43),0,IF(B43=\"StrapOnly\",VLOOKUP(E43,ClassicData!$AF:$AG,2,FALSE))))","v":0}]
[{"$nulls":7},{"v":0,"d":"$0.00"},null,{"v":0,"d":"$0.00"},{"$f":"IFERROR(IF(B44=ClassicBreakdown!$B$7,ClassicBreakdown!$G$5,IF('Order Form'!B44=ClassicBreakdown!$C$7,ClassicBreakdown!$G$5,IF('Order Form'!B44=ClassicBreakdown!$J$8,ClassicBreakdown!$L$7,IF('Order Form'!B44=ClassicBreakdown!$B$33,ClassicBreakdown!$D$32,IF('Order Form'!B44=ClassicBreakdown!$J$31,ClassicBreakdown!$L$30,IF('Order Form'!B44=ClassicBreakdown!$O$8,ClassicBreakdown!$Q$7,0)))))),\"MOQ\")","v":{"v":0,"d":"$0.00"}},{"$f":"IF(B44=\"Etched\",T44,IF(B44=\"Color Print\",S44,IF(B44=\"Embossed\",Q44,IF(B44=\"Debossed\",R44,IF(B44=\"Polished Plate\",#REF!,0)))))","v":{"v":0,"d":"$0.00"}},{"$f":"IF(ISBLANK(E44),0,IF(B44=\"Strap Only\",0,VLOOKUP(E44,ClassicData!$U:$V,2,FALSE)))","v":{"v":0,"d":"$0.00"}},{"$f":"IF(ISBLANK(F44),0,VLOOKUP(F44,ClassicData!$Y:$Z,2,FALSE))","v":{"v":0,"d":"$0.00"}},{"v":0,"d":"$0.00"},{"$f":"IF(ISBLANK(G44),0,VLOOKUP(G44,ClassicData!$AB:$AC,2,FALSE))","v":{"v":0,"d":"$0.00"}},{"v":0,"d":"$0.00"},{"v":0,"d":"$0.00"},{"$f":"IF(ISBLANK(C44),0,IF(U44=1,'Go-In! & Fast Eddie Package BD'!$G$32,IF('Order Form'!V44=1,'Go-In! & Fast Eddie Package BD'!$G$4,IF('Order Form'!W44=1,0,0))))","v":{"v":0,"d":"$0.00"}},{"$f":"IF(ISBLANK(C44),0,IF(U44=1,'Go-In! & Fast Eddie Package BD'!$G$32,IF('Order Form'!V44=1,'Go-In! & Fast Eddie Package BD'!$G$4,IF('Order Form'!W44=1,0,0))))","v":{"v":0,"d":"$0.00"}},0,0,0,{"$f":"(IF(ISBLANK(E44),0,IF(B44=\"StrapOnly\",VLOOKUP(E44,ClassicData!$AF:$AG,2,FALSE))))","v":0}]
[{"$nulls":7},{"v":0,"d":"$0.00"},null,{"v":0,"d":"$0.00"},{"$f":"IFERROR(IF(B45=ClassicBreakdown!$B$7,ClassicBreakdown!$G$5,IF('Order Form'!B45=ClassicBreakdown!$C$7,ClassicBreakdown!$G$5,IF('Order Form'!B45=ClassicBreakdown!$J$8,ClassicBreakdown!$L$7,IF('Order Form'!B45=ClassicBreakdown!$B$33,ClassicBreakdown!$D$32,IF('Order Form'!B45=ClassicBreakdown!$J$31,ClassicBreakdown!$L$30,IF('Order Form'!B45=ClassicBreakdown!$O$8,ClassicBreakdown!$Q$7,0)))))),\"MOQ\")","v":{"v":0,"d":"$0.00"}},{"$f":"IF(B45=\"Etched\",T45,IF(B45=\"Color Print\",S45,IF(B45=\"Embossed\",Q45,IF(B45=\"Debossed\",R45,IF(B45=\"Polished Plate\",#REF!,0)))))","v":{"v":0,"d":"$0.00"}},{"$f":"IF(ISBLANK(E45),0,IF(B45=\"Strap Only\",0,VLOOKUP(E45,ClassicData!$U:$V,2,FALSE)))","v":{"v":0,"d":"$0.00"}},{"$f":"IF(ISBLANK(F45),0,VLOOKUP(F45,ClassicData!$Y:$Z,2,FALSE))","v":{"v":0,"d":"$0.00"}},{"v":0,"d":"$0.00"},{"$f":"IF(ISBLANK(G45),0,VLOOKUP(G45,ClassicData!$AB:$AC,2,FALSE))","v":{"v":0,"d":"$0.00"}},{"v":0,"d":"$0.00"},{"v":0,"d":"$0.00"},{"$f":"IF(ISBLANK(C45),0,IF(U45=1,'Go-In! & Fast Eddie Package BD'!$G$32,IF('Order Form'!V45=1,'Go-In! & Fast Eddie Package BD'!$G$4,IF('Order Form'!W45=1,0,0))))","v":{"v":0,"d":"$0.00"}},{"$f":"IF(ISBLANK(C45),0,IF(U45=1,'Go-In! & Fast Eddie Package BD'!$G$32,IF('Order Form'!V45=1,'Go-In! & Fast Eddie Package BD'!$G$4,IF('Order Form'!W45=1,0,0))))","v":{"v":0,"d":"$0.00"}},0,0,0,{"$f":"(IF(ISBLANK(E45),0,IF(B45=\"StrapOnly\",VLOOKUP(E45,ClassicData!$AF:$AG,2,FALSE))))","v":0}]
[{"$nulls":7},{"v":0,"d":"$0.00"},null,{"v":0,"d":"$0.00"},{"$f":"IFERROR(IF(B46=ClassicBreakdown!$B$7,ClassicBreakdown!$G$5,IF('Order Form'!B46=ClassicBreakdown!$C$7,ClassicBreakdown!$G$5,IF('Order Form'!B46=ClassicBreakdown!$J$8,ClassicBreakdown!$L$7,IF('Order Form'!B46=ClassicBreakdown!$B$33,ClassicBreakdown!$D$32,IF('Order Form'!B46=ClassicBreakdown!$J$31,ClassicBreakdown!$L$30,IF('Order Form'!B46=ClassicBreakdown!$O$8,ClassicBreakdown!$Q$7,0)))))),\"MOQ\")","v":{"v":0,"d":"$0.00"}},{"$f":"IF(B46=\"Etched\",T46,IF(B46=\"Color Print\",S46,IF(B46=\"Embossed\",Q46,IF(B46=\"Debossed\",R46,IF(B46=\"Polished Plate\",#REF!,0)))))","v":{"v":0,"d":"$0.00"}},{"$f":"IF(ISBLANK(E46),0,IF(B46=\"Strap Only\",0,VLOOKUP(E46,ClassicData!$U:$V,2,FALSE)))","v":{"v":0,"d":"$0.00"}},{"$f":"IF(ISBLANK(F46),0,VLOOKUP(F46,ClassicData!$Y:$Z,2,FALSE))","v":{"v":0,"d":"$0.00"}},{"v":0,"d":"$0.00"},{"$f":"IF(ISBLANK(G46),0,VLOOKUP(G46,ClassicData!$AB:$AC,2,FALSE))","v":{"v":0,"d":"$0.00"}},{"v":0,"d":"$0.00"},{"v":0,"d":"$0.00"},{"$f":"IF(ISBLANK(C46),0,IF(U46=1,'Go-In! & Fast Eddie Package BD'!$G$32,IF('Order Form'!V46=1,'Go-In! & Fast Eddie Package BD'!$G$4,IF('Order Form'!W46=1,0,0))))","v":{"v":0,"d":"$0.00"}},{"$f":"IF(ISBLANK(C46),0,IF(U46=1,'Go-In! & Fast Eddie Package BD'!$G$32,IF('Order Form'!V46=1,'Go-In! & Fast Eddie Package BD'!$G$4,IF('Order Form'!W46=1,0,0))))","v":{"v":0,"d":"$0.00"}},0,0,0,{"$f":"(IF(ISBLANK(E46),0,IF(B46=\"StrapOnly\",VLOOKUP(E46,ClassicData!$AF:$AG,2,FALSE))))","v":0}]
[{"$nulls":7},{"v":0,"d":"$0.00"},null,{"v":0,"d":"$0.00"},{"$f":"IFERROR(IF(B47=ClassicBreakdown!$B$7,ClassicBreakdown!$G$5,IF('Order Form'!B47=ClassicBreakdown!$C$7,ClassicBreakdown!$G$5,IF('Order Form'!B47=ClassicBreakdown!$J$8,ClassicBreakdown!$L$7,IF('Order Form'!B47=ClassicBreakdown!$B$33,ClassicBreakdown!$D$32,IF('Order Form'!B47=ClassicBreakdown!$J$31,ClassicBreakdown!$L$30,IF('Order Form'!B47=ClassicBreakdown!$O$8,ClassicBreakdown!$Q$7,0)))))),\"MOQ\")","v":{"v":0,"d":"$0.00"}},{"$f":"IF(B47=\"Etched\",T47,IF(B47=\"Color Print\",S47,IF(B47=\"Embossed\",Q47,IF(B47=\"Debossed\",R47,IF(B47=\"Polished Plate\",#REF!,0)))))","v":{"v":0,"d":"$0.00"}},{"$f":"IF(ISBLANK(E47),0,IF(B47=\"Strap Only\",0,VLOOKUP(E47,ClassicData!$U:$V,2,FALSE)))","v":{"v":0,"d":"$0.00"}},{"$f":"IF(ISBLANK(F47),0,VLOOKUP(F47,ClassicData!$Y:$Z,2,FALSE))","v":{"v":0,"d":"$0.00"}},{"v":0,"d":"$0.00"},{"$f":"IF(ISBLANK(G47),0,VLOOKUP(G47,ClassicData!$AB:$AC,2,FALSE))","v":{"v":0,"d":"$0.00"}},{"v":0,"d":"$0.00"},{"v":0,"d":"$0.00"},{"$f":"IF(ISBLANK(C47),0,IF(U47=1,'Go-In! & Fast Eddie Package BD'!$G$32,IF('Order Form'!V47=1,'Go-In! & Fast Eddie Package BD'!$G$4,IF('Order Form'!W47=1,0,0))))","v":{"v":0,"d":"$0.00"}},{"$f":"IF(ISBLANK(C47),0,IF(U47=1,'Go-In! & Fast Eddie Package BD'!$G$32,IF('Order Form'!V47=1,'Go-In! & Fast Eddie Package BD'!$G$4,IF('Order Form'!W47=1,0,0))))","v":{"v":0,"d":"$0.00"}},0,0,0,{"$f":"(IF(ISBLANK(E47),0,IF(B47=\"StrapOnly\",VLOOKUP(E47,ClassicData!$AF:$AG,2,FALSE))))","v":0}]
[{"$nulls":7},{"v":0,"d":"$0.00"},null,{"v":0,"d":"$0.00"},{"$f":"IFERROR(IF(B48=ClassicBreakdown!$B$7,ClassicBreakdown!$G$5,IF('Order Form'!B48=ClassicBreakdown!$C$7,ClassicBreakdown!$G$5,IF('Order Form'!B48=ClassicBreakdown!$J$8,ClassicBreakdown!$L$7,IF('Order Form'!B48=ClassicBreakdown!$B$33,ClassicBreakdown!$D$32,IF('Order Form'!B48=ClassicBreakdown!$J$31,ClassicBreakdown!$L$30,IF('Order Form'!B48=ClassicBreakdown!$O$8,ClassicBreakdown!$Q$7,0)))))),\"MOQ\")","v":{"v":0,"d":"$0.00"}},{"$f":"IF(B48=\"Etched\",T48,IF(B48=\"Color Print\",S48,IF(B48=\"Embossed\",Q48,IF(B48=\"Debossed\",R48,IF(B48=\"Polished Plate\",#REF!,0)))))","v":{"v":0,"d":"$0.00"}},{"$f":"IF(ISBLANK(E48),0,IF(B48=\"Strap Only\",0,VLOOKUP(E48,ClassicData!$U:$V,2,FALSE)))","v":{"v":0,"d":"$0.00"}},{"$f":"IF(ISBLANK(F48),0,VLOOKUP(F48,ClassicData!$Y:$Z,2,FALSE))","v":{"v":0,"d":"$0.00"}},{"v":0,"d":"$0.00"},{"$f":"IF(ISBLANK(G48),0,VLOOKUP(G48,ClassicData!$AB:$AC,2,FALSE))","v":{"v":0,"d":"$0.00"}},{"v":0,"d":"$0.00"},{"v":0,"d":"$0.00"},{"$f":"IF(ISBLANK(C48),0,IF(U48=1,'Go-In! & Fast Eddie Package BD'!$G$32,IF('Order Form'!V48=1,'Go-In! & Fast Eddie Package BD'!$G$4,IF('Order Form'!W48=1,0,0))))","v":{"v":0,"d":"$0.00"}},{"$f":"IF(ISBLANK(C48),0,IF(U48=1,'Go-In! & Fast Eddie Package BD'!$G$32,IF('Order Form'!V48=1,'Go-In! & Fast Eddie Package BD'!$G$4,IF('Order Form'!W48=1,0,0))))","v":{"v":0,"d":"$0.00"}},0,0,0,{"$f":"(IF(ISBLANK(E48),0,IF(B48=\"StrapOnly\",VLOOKUP(E48,ClassicData!$AF:$AG,2,FALSE))))","v":0}]
[{"$nulls":7},{"v":0,"d":"$0.00"},null,{"v":0,"d":"$0.00"},{"$f":"IFERROR(IF(B49=ClassicBreakdown!$B$7,ClassicBreakdown!$G$5,IF('Order Form'!B49=ClassicBreakdown!$C$7,ClassicBreakdown!$G$5,IF('Order Form'!B49=ClassicBreakdown!$J$8,ClassicBreakdown!$L$7,IF('Order Form'!B49=ClassicBreakdown!$B$33,ClassicBreakdown!$D$32,IF('Order Form'!B49=ClassicBreakdown!$J$31,ClassicBreakdown!$L$30,IF('Order Form'!B49=ClassicBreakdown!$O$8,ClassicBreakdown!$Q$7,0)))))),\"MOQ\")","v":{"v":0,"d":"$0.00"}},{"$f":"IF(B49=\"Etched\",T49,IF(B49=\"Color Print\",S49,IF(B49=\"Embossed\",Q49,IF(B49=\"Debossed\",R49,IF(B49=\"Polished Plate\",#REF!,0)))))","v":{"v":0,"d":"$0.00"}},{"$f":"IF(ISBLANK(E49),0,IF(B49=\"Strap Only\",0,VLOOKUP(E49,ClassicData!$U:$V,2,FALSE)))","v":{"v":0,"d":"$0.00"}},{"$f":"IF(ISBLANK(F49),0,VLOOKUP(F49,ClassicData!$Y:$Z,2,FALSE))","v":{"v":0,"d":"$0.00"}},{"v":0,"d":"$0.00"},{"$f":"IF(ISBLANK(G49),0,VLOOKUP(G49,ClassicData!$AB:$AC,2,FALSE))","v":{"v":0,"d":"$0.00"}},{"v":0,"d":"$0.00"},{"v":0,"d":"$0.00"},{"$f":"IF(ISBLANK(C49),0,IF(U49=1,'Go-In! & Fast Eddie Package BD'!$G$32,IF('Order Form'!V49=1,'Go-In! & Fast Eddie Package BD'!$G$4,IF('Order Form'!W49=1,0,0))))","v":{"v":0,"d":"$0.00"}},{"$f":"IF(ISBLANK(C49),0,IF(U49=1,'Go-In! & Fast Eddie Package BD'!$G$32,IF('Order Form'!V49=1,'Go-In! & Fast Eddie Package BD'!$G$4,IF('Order Form'!W49=1,0,0))))","v":{"v":0,"d":"$0.00"}},0,0,0,{"$f":"(IF(ISBLANK(E49),0,IF(B49=\"StrapOnly\",VLOOKUP(E49,ClassicData!$AF:$AG,2,FALSE))))","v":0}]
[{"$nulls":7},{"v":0,"d":"$0.00"},null,{"v":0,"d":"$0.00"},{"$f":"IFERROR(IF(B50=ClassicBreakdown!$B$7,ClassicBreakdown!$G$5,IF('Order Form'!B50=ClassicBreakdown!$C$7,ClassicBreakdown!$G$5,IF('Order Form'!B50=ClassicBreakdown!$J$8,ClassicBreakdown!$L$7,IF('Order Form'!B50=ClassicBreakdown!$B$33,ClassicBreakdown!$D$32,IF('Order Form'!B50=ClassicBreakdown!$J$31,ClassicBreakdown!$L$30,IF('Order Form'!B50=ClassicBreakdown!$O$8,ClassicBreakdown!$Q$7,0)))))),\"MOQ\")","v":{"v":0,"d":"$0.00"}},{"$f":"IF(B50=\"Etched\",T50,IF(B50=\"Color Print\",S50,IF(B50=\"Embossed\",Q50,IF(B50=\"Debossed\",R50,IF(B50=\"Polished Plate\",#REF!,0)))))","v":{"v":0,"d":"$0.00"}},{"$f":"IF(ISBLANK(E50),0,IF(B50=\"Strap Only\",0,VLOOKUP(E50,ClassicData!$U:$V,2,FALSE)))","v":{"v":0,"d":"$0.00"}},{"$f":"IF(ISBLANK(F50),0,VLOOKUP(F50,ClassicData!$Y:$Z,2,FALSE))","v":{"v":0,"d":"$0.00"}},{"v":0,"d":"$0.00"},{"$f":"IF(ISBLANK(G50),0,VLOOKUP(G50,ClassicData!$AB:$AC,2,FALSE))","v":{"v":0,"d":"$0.00"}},{"v":0,"d":"$0.00"},{"v":0,"d":"$0.00"},{"$f":"IF(ISBLANK(C50),0,IF(U50=1,'Go-In! & Fast Eddie Package BD'!$G$32,IF('Order Form'!V50=1,'Go-In! & Fast Eddie Package BD'!$G$4,IF('Order Form'!W50=1,0,0))))","v":{"v":0,"d":"$0.00"}},{"$f":"IF(ISBLANK(C50),0,IF(U50=1,'Go-In! & Fast Eddie Package BD'!$G$32,IF('Order Form'!V50=1,'Go-In! & Fast Eddie Package BD'!$G$4,IF('Order Form'!W50=1,0,0))))","v":{"v":0,"d":"$0.00"}},0,0,0,{"$f":"(IF(ISBLANK(E50),0,IF(B50=\"StrapOnly\",VLOOKUP(E50,ClassicData!$AF:$AG,2,FALSE))))","v":0}]
[{"$nulls":7},{"v":0,"d":"$0.00"},null,{"v":0,"d":"$0.00"},{"$f":"IFERROR(IF(B51=ClassicBreakdown!$B$7,ClassicBreakdown!$G$5,IF('Order Form'!B51=ClassicBreakdown!$C$7,ClassicBreakdown!$G$5,IF('Order Form'!B51=ClassicBreakdown!$J$8,ClassicBreakdown!$L$7,IF('Order Form'!B51=ClassicBreakdown!$B$33,ClassicBreakdown!$D$32,IF('Order Form'!B51=ClassicBreakdown!$J$31,ClassicBreakdown!$L$30,IF('Order Form'!B51=ClassicBreakdown!$O$8,ClassicBreakdown!$Q$7,0)))))),\"MOQ\")","v":{"v":0,"d":"$0.00"}},{"$f":"IF(B51=\"Etched\",T51,IF(B51=\"Color Print\",S51,IF(B51=\"Embossed\",Q51,IF(B51=\"Debossed\",R51,IF(B51=\"Polished Plate\",#REF!,0)))))","v":{"v":0,"d":"$0.00"}},{"$f":"IF(ISBLANK(E51),0,IF(B51=\"Strap Only\",0,VLOOKUP(E51,ClassicData!$U:$V,2,FALSE)))","v":{"v":0,"d":"$0.00"}},{"$f":"IF(ISBLANK(F51),0,VLOOKUP(F51,ClassicData!$Y:$Z,2,FALSE))","v":{"v":0,"d":"$0.00"}},{"v":0,"d":"$0.00"},{"$f":"IF(ISBLANK(G51),0,VLOOKUP(G51,ClassicData!$AB:$AC,2,FALSE))","v":{"v":0,"d":"$0.00"}},{"v":0,"d":"$0.00"},{"v":0,"d":"$0.00"},{"$f":"IF(ISBLANK(C51),0,IF(U51=1,'Go-In! & Fast Eddie Package BD'!$G$32,IF('Order Form'!V51=1,'Go-In! & Fast Eddie Package BD'!$G$4,IF('Order Form'!W51=1,0,0))))","v":{"v":0,"d":"$0.00"}},{"$f":"IF(ISBLANK(C51),0,IF(U51=1,'Go-In! & Fast Eddie Package BD'!$G$32,IF('Order Form'!V51=1,'Go-In! & Fast Eddie Package BD'!$G$4,IF('Order Form'!W51=1,0,0))))","v":{"v":0,"d":"$0.00"}},0,0,0,{"$f":"(IF(ISBLANK(E51),0,IF(B51=\"StrapOnly\",VLOOKUP(E51,ClassicData!$AF:$AG,2,FALSE))))","v":0}]
[{"$nulls":7},{"v":0,"d":"$0.00"},null,{"v":0,"d":"$0.00"},{"$f":"IFERROR(IF(B52=ClassicBreakdown!$B$7,ClassicBreakdown!$G$5,IF('Order Form'!B52=ClassicBreakdown!$C$7,ClassicBreakdown!$G$5,IF('Order Form'!B52=ClassicBreakdown!$J$8,ClassicBreakdown!$L$7,IF('Order Form'!B52=ClassicBreakdown!$B$33,ClassicBreakdown!$D$32,IF('Order Form'!B52=ClassicBreakdown!$J$31,ClassicBreakdown!$L$30,IF('Order Form'!B52=ClassicBreakdown!$O$8,ClassicBreakdown!$Q$7,0)))))),\"MOQ\")","v":{"v":0,"d":"$0.00"}},{"$f":"IF(B52=\"Etched\",T52,IF(B52=\"Color Print\",S52,IF(B52=\"Embossed\",Q52,IF(B52=\"Debossed\",R52,IF(B52=\"Polished Plate\",#REF!,0)))))","v":{"v":0,"d":"$0.00"}},{"$f":"IF(ISBLANK(E52),0,IF(B52=\"Strap Only\",0,VLOOKUP(E52,ClassicData!$U:$V,2,FALSE)))","v":{"v":0,"d":"$0.00"}},{"$f":"IF(ISBLANK(F52),0,VLOOKUP(F52,ClassicData!$Y:$Z,2,FALSE))","v":{"v":0,"d":"$0.00"}},{"v":0,"d":"$0.00"},{"$f":"IF(ISBLANK(G52),0,VLOOKUP(G52,ClassicData!$AB:$AC,2,FALSE))","v":{"v":0,"d":"$0.00"}},{"v":0,"d":"$0.00"},{"v":0,"d":"$0.00"},{"$f":"IF(ISBLANK(C52),0,IF(U52=1,'Go-In! & Fast Eddie Package BD'!$G$32,IF('Order Form'!V52=1,'Go-In! & Fast Eddie Package BD'!$G$4,IF('Order Form'!W52=1,0,0))))","v":{"v":0,"d":"$0.00"}},{"$f":"IF(ISBLANK(C52),0,IF(U52=1,'Go-In! & Fast Eddie Package BD'!$G$32,IF('Order Form'!V52=1,'Go-In! & Fast Eddie Package BD'!$G$4,IF('Order Form'!W52=1,0,0))))","v":{"v":0,"d":"$0.00"}},0,0,0,{"$f":"(IF(ISBLANK(E52),0,IF(B52=\"StrapOnly\",VLOOKUP(E52,ClassicData!$AF:$AG,2,FALSE))))","v":0}]
[{"$nulls":7},{"v":0,"d":"$0.00"},null,{"v":0,"d":"$0.00"},{"$f":"IFERROR(IF(B53=ClassicBreakdown!$B$7,ClassicBreakdown!$G$5,IF('Order Form'!B53=ClassicBreakdown!$C$7,ClassicBreakdown!$G$5,IF('Order Form'!B53=ClassicBreakdown!$J$8,ClassicBreakdown!$L$7,IF('Order Form'!B53=ClassicBreakdown!$B$33,ClassicBreakdown!$D$32,IF('Order Form'!B53=ClassicBreakdown!$J$31,ClassicBreakdown!$L$30,IF('Order Form'!B53=ClassicBreakdown!$O$8,ClassicBreakdown!$Q$7,0)))))),\"MOQ\")","v":{"v":0,"d":"$0.00"}},{"$f":"IF(B53=\"Etched\",T53,IF(B53=\"Color Print\",S53,IF(B53=\"Embossed\",Q53,IF(B53=\"Debossed\",R53,IF(B53=\"Polished Plate\",#REF!,0)))))","v":{"v":0,"d":"$0.00"}},{"$f":"IF(ISBLANK(E53),0,IF(B53=\"Strap Only\",0,VLOOKUP(E53,ClassicData!$U:$V,2,FALSE)))","v":{"v":0,"d":"$0.00"}},{"$f":"IF(ISBLANK(F53),0,VLOOKUP(F53,ClassicData!$Y:$Z,2,FALSE))","v":{"v":0,"d":"$0.00"}},{"v":0,"d":"$0.00"},{"$f":"IF(ISBLANK(G53),0,VLOOKUP(G53,ClassicData!$AB:$AC,2,FALSE))","v":{"v":0,"d":"$0.00"}},{"v":0,"d":"$0.00"},{"v":0,"d":"$0.00"},{"$f":"IF(ISBLANK(C53),0,IF(U53=1,'Go-In! & Fast Eddie Package BD'!$G$32,IF('Order Form'!V53=1,'Go-In! & Fast Eddie Package BD'!$G$4,IF('Order Form'!W53=1,0,0))))","v":{"v":0,"d":"$0.00"}},{"$f":"IF(ISBLANK(C53),0,IF(U53=1,'Go-In! & Fast Eddie Package BD'!$G$32,IF('Order Form'!V53=1,'Go-In! & Fast Eddie Package BD'!$G$4,IF('Order Form'!W53=1,0,0))))","v":{"v":0,"d":"$0.00"}},0,0,0,{"$f":"(IF(ISBLANK(E53),0,IF(B53=\"StrapOnly\",VLOOKUP(E53,ClassicData!$AF:$AG,2,FALSE))))","v":0}]
[{"$nulls":4},"* Limited Stock Strap - Subject to availability"]
[{"$nulls":5},"Important Notice: A qty of 30+ pcs of any one strap requires call ahead confirmation"]
[null,null,"Order Buckles ONLY Below:"]
["Logo Description","Customization","Buckle","Logo Placement","Ball Mark / Tool",null,null,"Price Ea.","Qty","Total","Base Charge","Buckle Adjust","BM/Tool Adjust",{"$nulls":3},"Embossed Buckle Adjust","Debossed Buckle Adjust","Color Print Buckle Adjust","Etched Buckle Adjust","Fast Eddie","Go-In!","Classic"]
[{"$nulls":7},{"$f":"IF(K58=\"Less Than MOQ\",K58,SUM(K58:M58))","v":{"v":0,"d":"$0.00"}},null,{"$f":"H58*I58","v":{"v":0,"d":"$0.00"}},{"$f":"IF(B58=BuckleBreakdown!$B$7,BuckleBreakdown!$G$5,IF('Order Form'!B58=BuckleBreakdown!$C$7,BuckleBreakdown!$G$5,IF('Order Form'!B58=BuckleBreakdown!$B$23,BuckleBreakdown!$D$22,IF('Order Form'!B58=BuckleBreakdown!$J$8,BuckleBreakdown!$L$7,IF('Order Form'!B58=BuckleBreakdown!$J$21,BuckleBreakdown!$L$20,0)))))","v":{"v":0,"d":"$0.00"}},{"$f":"IF(B58=\"Etched\",T58,IF(B58=\"Color Print\",S58,IF(B58=\"Embossed\",Q58,IF(B58=\"Debossed\",R58,IF(B58=\"Polished Plate\",#REF!,0)))))","v":{"v":0,"d":"$0.00"}},{"$f":"IF(ISBLANK(E58),0,VLOOKUP(E58,BuckleData!$Q:$R,2,FALSE))","v":{"v":0,"d":"$0.00"}},{"$nulls":3},{"$f":"IF(U58=1,4.5,IF(V58=1,2,0))","v":{"v":0,"d":"$0.00"}},{"$f":"IF(U58=1,4.5,IF(V58=1,2,0))","v":{"v":0,"d":"$0.00"}},{"$f":"IF(ISBLANK(B58),0,IF(U58=1,'Go-In! & Fast Eddie Buckle BD'!$G$30,IF('Order Form'!V58=1,'Go-In! & Fast Eddie Buckle BD'!$G$4,IF('Order Form'!W58=1,0,0))))","v":{"v":0,"d":"$0.00"}},{"$f":"IF(ISBLANK(C58),0,IF(U58=1,'Go-In! & Fast Eddie Buckle BD'!$G$30,IF('Order Form'!V58=1,'Go-In! & Fast Eddie Buckle BD'!$G$4,IF('Order Form'!W58=1,0,0))))","v":{"v":0,"d":"$0.00"}},{"$f":"IFERROR(IF(SEARCH(\"Fast Eddie\",C58,1),1),0)","v":0},{"$f":"IFERROR(IF(SEARCH(\"Go-In!\",C58,1),1),0)","v":0},{"$f":"IFERROR(IF(SEARCH(\"Classic\",C58,1),1),0)","v":0}]
[{"$nulls":7},{"v":0,"d":"$0.00"},null,{"$f":"H59*I59","v":{"v":0,"d":"$0.00"}},{"$f":"IF(B59=BuckleBreakdown!$B$7,BuckleBreakdown!$G$5,IF('Order Form'!B59=BuckleBreakdown!$C$7,BuckleBreakdown!$G$5,IF('Order Form'!B59=BuckleBreakdown!$B$23,BuckleBreakdown!$D$22,IF('Order Form'!B59=BuckleBreakdown!$J$8,BuckleBreakdown!$L$7,IF('Order Form'!B59=BuckleBreakdown!$J$21,BuckleBreakdown!$L$20,0)))))","v":{"v":0,"d":"$0.00"}},{"$f":"IF(B59=\"Etched\",T59,IF(B59=\"Color Print\",S59,IF(B59=\"Embossed\",Q59,IF(B59=\"Debossed\",R59,IF(B59=\"Polished Plate\",#REF!,0)))))","v":{"v":0,"d":"$0.00"}},{"$f":"IF(ISBLANK(E59),0,VLOOKUP(E59,BuckleData!$Q:$R,2,FALSE))","v":{"v":0,"d":"$0.00"}},{"$nulls":3},{"$f":"IF(U59=1,4.5,IF(V59=1,2,0))","v":{"v":0,"d":"$0.00"}},{"$f":"IF(U59=1,4.5,IF(V59=1,2,0))","v":{"v":0,"d":"$0.00"}},{"$f":"IF(ISBLANK(B59),0,IF(U59=1,'Go-In! & Fast Eddie Buckle BD'!$G$30,IF('Order Form'!V59=1,'Go-In! & Fast Eddie Buckle BD'!$G$4,IF('Order Form'!W59=1,0,0))))","v":{"v":0,"d":"$0.00"}},{"$f":"IF(ISBLANK(C59),0,IF(U59=1,'Go-In! & Fast Eddie Buckle BD'!$G$30,IF('Order Form'!V59=1,'Go-In! & Fast Eddie Buckle BD'!$G$4,IF('Order Form'!W59=1,0,0))))","v":{"v":0,"d":"$0.00"}},{"$f":"IFERROR(IF(SEARCH(\"Fast Eddie\",C59,1),1),0)","v":0},{"$f":"IFERROR(IF(SEARCH(\"Go-In!\",C59,1),1),0)","v":0},{"$f":"IFERROR(IF(SEARCH(\"Classic\",C59,1),1),0)","v":0}]
[{"$nulls":7},{"v":0,"d":"$0.00"},null,{"v":0,"d":"$0.00"},{"$f":"IF(B60=BuckleBreakdown!$B$7,BuckleBreakdown!$G$5,IF('Order Form'!B60=BuckleBreakdown!$C$7,BuckleBreakdown!$G$5,IF('Order Form'!B60=BuckleBreakdown!$B$23,BuckleBreakdown!$D$22,IF('Order Form'!B60=BuckleBreakdown!$J$8,BuckleBreakdown!$L$7,IF('Order Form'!B60=BuckleBreakdown!$J$21,BuckleBreakdown!$L$20,0)))))","v":{"v":0,"d":"$0.00"}},{"$f":"IF(B60=\"Etched\",T60,IF(B60=\"Color Print\",S60,IF(B60=\"Embossed\",Q60,IF(B60=\"Debossed\",R60,IF(B60=\"Polished Plate\",#REF!,0)))))","v":{"v":0,"d":"$0.00"}},{"$f":"IF(ISBLANK(E60),0,VLOOKUP(E60,BuckleData!$Q:$R,2,FALSE))","v":{"v":0,"d":"$0.00"}},{"$nulls":3},{"v":0,"d":"$0.00"},{"v":0,"d":"$0.00"},{"$f":"IF(ISBLANK(B60),0,IF(U60=1,'Go-In! & Fast Eddie Buckle BD'!$G$30,IF('Order Form'!V60=1,'Go-In! & Fast Eddie Buckle BD'!$G$4,IF('Order Form'!W60=1,0,0))))","v":{"v":0,"d":"$0.00"}},{"$f":"IF(ISBLANK(C60),0,IF(U60=1,'Go-In! & Fast Eddie Buckle BD'!$G$30,IF('Order Form'!V60=1,'Go-In! & Fast Eddie Buckle BD'!$G$4,IF('Order Form'!W60=1,0,0))))","v":{"v":0,"d":"$0.00"}},0,0,0]
[{"$nulls":7},{"v":0,"d":"$0.00"},null,{"v":0,"d":"$0.00"},{"$f":"IF(B61=BuckleBreakdown!$B$7,BuckleBreakdown!$G$5,IF('Order Form'!B61=BuckleBreakdown!$C$7,BuckleBreakdown!$G$5,IF('Order Form'!B61=BuckleBreakdown!$B$23,BuckleBreakdown!$D$22,IF('Order Form'!B61=BuckleBreakdown!$J$8,BuckleBreakdown!$L$7,IF('Order Form'!B61=BuckleBreakdown!$J$21,BuckleBreakdown!$L$20,0)))))","v":{"v":0,"d":"$0.00"}},{"$f":"IF(B61=\"Etched\",T61,IF(B61=\"Color Print\",S61,IF(B61=\"Embossed\",Q61,IF(B61=\"Debossed\",R61,IF(B61=\"Polished Plate\",#REF!,0)))))","v":{"v":0,"d":"$0.00"}},{"$f":"IF(ISBLANK(E61),0,VLOOKUP(E61,BuckleData!$Q:$R,2,FALSE))","v":{"v":0,"d":"$0.00"}},{"$nulls":3},{"v":0,"d":"$0.00"},{"v":0,"d":"$0.00"},{"$f":"IF(ISBLANK(B61),0,IF(U61=1,'Go-In! & Fast Eddie Buckle BD'!$G$30,IF('Order Form'!V61=1,'Go-In! & Fast Eddie Buckle BD'!$G$4,IF('Order Form'!W61=1,0,0))))","v":{"v":0,"d":"$0.00"}},{"$f":"IF(ISBLANK(C61),0,IF(U61=1,'Go-In! & Fast Eddie Buckle BD'!$G$30,IF('Order Form'!V61=1,'Go-In! & Fast Eddie Buckle BD'!$G$4,IF('Order Form'!W61=1,0,0))))","v":{"v":0,"d":"$0.00"}},0,0,0]
[{"$nulls":7},{"v":0,"d":"$0.00"},null,{"v":0,"d":"$0.00"},{"$f":"IF(B62=BuckleBreakdown!$B$7,BuckleBreakdown!$G$5,IF('Order Form'!B62=BuckleBreakdown!$C$7,BuckleBreakdown!$G$5,IF('Order Form'!B62=BuckleBreakdown!$B$23,BuckleBreakdown!$D$22,IF('Order Form'!B62=BuckleBreakdown!$J$8,BuckleBreakdown!$L$7,IF('Order Form'!B62=BuckleBreakdown!$J$21,BuckleBreakdown!$L$20,0)))))","v":{"v":0,"d":"$0.00"}},{"$f":"IF(B62=\"Etched\",T62,IF(B62=\"Color Print\",S62,IF(B62=\"Embossed\",Q62,IF(B62=\"Debossed\",R62,IF(B62=\"Polished Plate\",#REF!,0)))))","v":{"v":0,"d":"$0.00"}},{"$f":"IF(ISBLANK(E62),0,VLOOKUP(E62,BuckleData!$Q:$R,2,FALSE))","v":{"v":0,"d":"$0.00"}},{"$nulls":3},{"v":0,"d":"$0.00"},{"v":0,"d":"$0.00"},{"$f":"IF(ISBLANK(B62),0,IF(U62=1,'Go-In! & Fast Eddie Buckle BD'!$G$30,IF('Order Form'!V62=1,'Go-In! & Fast Eddie Buckle BD'!$G$4,IF('Order Form'!W62=1,0,0))))","v":{"v":0,"d":"$0.00"}},{"$f":"IF(ISBLANK(C62),0,IF(U62=1,'Go-In! & Fast Eddie Buckle BD'!$G$30,IF('Order Form'!V62=1,'Go-In! & Fast Eddie Buckle BD'!$G$4,IF('Order Form'!W62=1,0,0))))","v":{"v":0,"d":"$0.00"}},0,0,0]
[{"$nulls":7},{"v":0,"d":"$0.00"},null,{"v":0,"d":"$0.00"},{"$f":"IF(B63=BuckleBreakdown!$B$7,BuckleBreakdown!$G$5,IF('Order Form'!B63=BuckleBreakdown!$C$7,BuckleBreakdown!$G$5,IF('Order Form'!B63=BuckleBreakdown!$B$23,BuckleBreakdown!$D$22,IF('Order Form'!B63=BuckleBreakdown!$J$8,BuckleBreakdown!$L$7,IF('Order Form'!B63=BuckleBreakdown!$J$21,BuckleBreakdown!$L$20,0)))))","v":{"v":0,"d":"$0.00"}},{"$f":"IF(B63=\"Etched\",T63,IF(B63=\"Color Print\",S63,IF(B63=\"Embossed\",Q63,IF(B63=\"Debossed\",R63,IF(B63=\"Polished Plate\",#REF!,0)))))","v":{"v":0,"d":"$0.00"}},{"$f":"IF(ISBLANK(E63),0,VLOOKUP(E63,BuckleData!$Q:$R,2,FALSE))","v":{"v":0,"d":"$0.00"}},{"$nulls":3},{"v":0,"d":"$0.00"},{"v":0,"d":"$0.00"},{"$f":"IF(ISBLANK(B63),0,IF(U63=1,'Go-In! & Fast Eddie Buckle BD'!$G$30,IF('Order Form'!V63=1,'Go-In! & Fast Eddie Buckle BD'!$G$4,IF('Order Form'!W63=1,0,0))))","v":{"v":0,"d":"$0.00"}},{"$f":"IF(ISBLANK(C63),0,IF(U63=1,'Go-In! & Fast Eddie Buckle BD'!$G$30,IF('Order Form'!V63=1,'Go-In! & Fast Eddie Buckle BD'!$G$4,IF('Order Form'!W63=1,0,0))))","v":{"v":0,"d":"$0.00"}},0,0,0]
[{"$nulls":7},{"v":0,"d":"$0.00"},null,{"v":0,"d":"$0.00"},{"$f":"IF(B64=BuckleBreakdown!$B$7,BuckleBreakdown!$G$5,IF('Order Form'!B64=BuckleBreakdown!$C$7,BuckleBreakdown!$G$5,IF('Order Form'!B64=BuckleBreakdown!$B$23,BuckleBreakdown!$D$22,IF('Order Form'!B64=BuckleBreakdown!$J$8,BuckleBreakdown!$L$7,IF('Order Form'!B64=BuckleBreakdown!$J$21,BuckleBreakdown!$L$20,0)))))","v":{"v":0,"d":"$0.00"}},{"$f":"IF(B64=\"Etched\",T64,IF(B64=\"Color Print\",S64,IF(B64=\"Embossed\",Q64,IF(B64=\"Debossed\",R64,IF(B64=\"Polished Plate\",#REF!,0)))))","v":{"v":0,"d":"$0.00"}},{"$f":"IF(ISBLANK(E64),0,VLOOKUP(E64,BuckleData!$Q:$R,2,FALSE))","v":{"v":0,"d":"$0.00"}},{"$nulls":3},{"v":0,"d":"$0.00"},{"v":0,"d":"$0.00"},{"$f":"IF(ISBLANK(B64),0,IF(U64=1,'Go-In! & Fast Eddie Buckle BD'!$G$30,IF('Order Form'!V64=1,'Go-In! & Fast Eddie Buckle BD'!$G$4,IF('Order Form'!W64=1,0,0))))","v":{"v":0,"d":"$0.00"}},{"$f":"IF(ISBLANK(C64),0,IF(U64=1,'Go-In! & Fast Eddie Buckle BD'!$G$30,IF('Order Form'!V64=1,'Go-In! & Fast Eddie Buckle BD'!$G$4,IF('Order Form'!W64=1,0,0))))","v":{"v":0,"d":"$0.00"}},0,0,0]
[{"$nulls":7},{"v":0,"d":"$0.00"},null,{"v":0,"d":"$0.00"},{"$f":"IF(B65=BuckleBreakdown!$B$7,BuckleBreakdown!$G$5,IF('Order Form'!B65=BuckleBreakdown!$C$7,BuckleBreakdown!$G$5,IF('Order Form'!B65=BuckleBreakdown!$B$23,BuckleBreakdown!$D$22,IF('Order Form'!B65=BuckleBreakdown!$J$8,BuckleBreakdown!$L$7,IF('Order Form'!B65=BuckleBreakdown!$J$21,BuckleBreakdown!$L$20,0)))))","v":{"v":0,"d":"$0.00"}},{"$f":"IF(B65=\"Etched\",T65,IF(B65=\"Color Print\",S65,IF(B65=\"Embossed\",Q65,IF(B65=\"Debossed\",R65,IF(B65=\"Polished Plate\",#REF!,0)))))","v":{"v":0,"d":"$0.00"}},{"$f":"IF(ISBLANK(E65),0,VLOOKUP(E65,BuckleData!$Q:$R,2,FALSE))","v":{"v":0,"d":"$0.00"}},{"$nulls":3},{"v":0,"d":"$0.00"},{"v":0,"d":"$0.00"},{"$f":"IF(ISBLANK(B65),0,IF(U65=1,'Go-In! & Fast Eddie Buckle BD'!$G$30,IF('Order Form'!V65=1,'Go-In! & Fast Eddie Buckle BD'!$G$4,IF('Order Form'!W65=1,0,0))))","v":{"v":0,"d":"$0.00"}},{"$f":"IF(ISBLANK(C65),0,IF(U65=1,'Go-In! & Fast Eddie Buckle BD'!$G$30,IF('Order Form'!V65=1,'Go-In! & Fast Eddie Buckle BD'!$G$4,IF('Order Form'!W65=1,0,0))))","v":{"v":0,"d":"$0.00"}},0,0,0]
[{"$nulls":7},{"v":0,"d":"$0.00"},null,{"v":0,"d":"$0.00"},{"$f":"IF(B66=BuckleBreakdown!$B$7,BuckleBreakdown!$G$5,IF('Order Form'!B66=BuckleBreakdown!$C$7,BuckleBreakdown!$G$5,IF('Order Form'!B66=BuckleBreakdown!$B$23,BuckleBreakdown!$D$22,IF('Order Form'!B66=BuckleBreakdown!$J$8,BuckleBreakdown!$L$7,IF('Order Form'!B66=BuckleBreakdown!$J$21,BuckleBreakdown!$L$20,0)))))","v":{"v":0,"d":"$0.00"}},{"$f":"IF(B66=\"Etched\",T66,IF(B66=\"Color Print\",S66,IF(B66=\"Embossed\",Q66,IF(B66=\"Debossed\",R66,IF(B66=\"Polished Plate\",#REF!,0)))))","v":{"v":0,"d":"$0.00"}},{"$f":"IF(ISBLANK(E66),0,VLOOKUP(E66,BuckleData!$Q:$R,2,FALSE))","v":{"v":0,"d":"$0.00"}},{"$nulls":3},{"v":0,"d":"$0.00"},{"v":0,"d":"$0.00"},{"$f":"IF(ISBLANK(B66),0,IF(U66=1,'Go-In! & Fast Eddie Buckle BD'!$G$30,IF('Order Form'!V66=1,'Go-In! & Fast Eddie Buckle BD'!$G$4,IF('Order Form'!W66=1,0,0))))","v":{"v":0,"d":"$0.00"}},{"$f":"IF(ISBLANK(C66),0,IF(U66=1,'Go-In! & Fast Eddie Buckle BD'!$G$30,IF('Order Form'!V66=1,'Go-In! & Fast Eddie Buckle BD'!$G$4,IF('Order Form'!W66=1,0,0))))","v":{"v":0,"d":"$0.00"}},0,0,0]
[{"$nulls":7},{"v":0,"d":"$0.00"},null,{"v":0,"d":"$0.00"},{"$f":"IF(B67=BuckleBreakdown!$B$7,BuckleBreakdown!$G$5,IF('Order Form'!B67=BuckleBreakdown!$C$7,BuckleBreakdown!$G$5,IF('Order Form'!B67=BuckleBreakdown!$B$23,BuckleBreakdown!$D$22,IF('Order Form'!B67=BuckleBreakdown!$J$8,BuckleBreakdown!$L$7,IF('Order Form'!B67=BuckleBreakdown!$J$21,BuckleBreakdown!$L$20,0)))))","v":{"v":0,"d":"$0.00"}},{"$f":"IF(B67=\"Etched\",T67,IF(B67=\"Color Print\",S67,IF(B67=\"Embossed\",Q67,IF(B67=\"Debossed\",R67,IF(B67=\"Polished Plate\",#REF!,0)))))","v":{"v":0,"d":"$0.00"}},{"$f":"IF(ISBLANK(E67),0,VLOOKUP(E67,BuckleData!$Q:$R,2,FALSE))","v":{"v":0,"d":"$0.00"}},{"$nulls":3},{"v":0,"d":"$0.00"},{"v":0,"d":"$0.00"},{"$f":"IF(ISBLANK(B67),0,IF(U67=1,'Go-In! & Fast Eddie Buckle BD'!$G$30,IF('Order Form'!V67=1,'Go-In! & Fast Eddie Buckle BD'!$G$4,IF('Order Form'!W67=1,0,0))))","v":{"v":0,"d":"$0.00"}},{"$f":"IF(ISBLANK(C67),0,IF(U67=1,'Go-In! & Fast Eddie Buckle BD'!$G$30,IF('Order Form'!V67=1,'Go-In! & Fast Eddie Buckle BD'!$G$4,IF('Order Form'!W67=1,0,0))))","v":{"v":0,"d":"$0.00"}},0,0,0]
[]
[null,null,"Price Level For Future Orders"]
[null,null,{"$f":"IFERROR(VLOOKUP(D71,G94:H99,2,FALSE),\"#1\")","v":"#1"},{"$nulls":4},"ORDER TOTAL:  ",{"$f":"SUM(I34:I53,I58:I67)","v":0},{"$f":"SUM(J34:J53,J58:J67)","v":{"v":0,"d":"$0.00"}}]
[{"$nulls":3},{"$f":"MAX(A31,ClassicBreakdown!E6,BuckleBreakdown!E6,'Go-In! & Fast Eddie Package BD'!E5,'Go-In! & Fast Eddie Buckle BD'!E5)","v":{"v":1,"d":"1.00"}}]
[null,"Terms & Conditions:",{"$nulls":3},"Orders are not scheduled for production until final approval from customer is received. Missing approval will delay order."]
[null,"1) A 50% Deposit is required on all custom orders"]
[null,"2) Any custom order over $5,000.00 may require 50% deposit subject to approval."]
[null,"3) RUSH ORDER: Any order that is shorter than the required lead time is subject to a rush order fee."]
[]
[null,"Order Notes:"]
{"$rows_empty":16}
[{"$nulls":5},"#1",1,"#1"]
[{"$nulls":5},"#2",2,"#2"]
[{"$nulls":5},"#3",3,"#3"]
[{"$nulls":5},"#4",4,"#4"]
[{"$nulls":5},"#5",5,"#5"]
[{"$nulls":5},"#6",6,"#6"]

{"sheet":"Lists","index":3,"n_rows":131,"n_cols":14,"rows_kept":131,"hidden":true}
[]
[null,"Master Lists"]
[]
[null,"Price Level",null,"Customization",null,"Buckles",null,"Straps",{"$nulls":3},"Packaging",null,"BallMarkTool"]
[]
[null,"PriceLevel",null,"Customization",null,"Embossed",null,"Strap",null,"LogoPlacement",null,"Packaging",null,"BallMarkTool"]
[]
[null,"#1",null,"Embossed",null,"(BGG7783) Go-In! Blank Gunmetal Beveled",null,"(SEL0869) Smooth Black",null,"Full (Center)",null,"Poly Carbonate Box",null,"Standard Ball Mark"]
[null,"#2",null,"Debossed",null,"(BGG7790) Go-In! Blank Nickel Beveled",null,"(SEL0760) Carbon Black",null,"Lower Right Corner (Reduced)",null,"Tournament Packaging",null,"Ball Mark - Etched Logo (add $3)"]
[null,"#3",null,"Etched",null,"(BCE7813) Classic Blank Gunmetal Beveled",null,"(SEL4683) Espresso",null,"Front logo hat only",null,"Tourney Pkg w/ Logo (add $1)",null,"Ball Mark - Color Logo (add $3)"]
[null,"#4",null,"ColorPrint",null,"(BCE7806) Classic Blank Nickel Beveled",null,"(SEL0753) Walnut Brown",{"$nulls":3},"Velvet Bag (add $1)",null,"Divot Tool - Etched Logo (add $3)"]
[null,"#5",null,"StrapOnly",null,"(BGG5406) Go-In! Gunmetal Beveled",null,"(SEL0906) Smooth White",{"$nulls":3},"Poly Carbonate Logo Insert (add $2)",null,"Divot Tool - Color Logo (add $3)"]
[null,"#6",null,"CustomRibbon",null,"(BGG4508) Go-In! Brushed Nickel Beveled",null,"(SCL3617) Deep Sea Navy Pebble Grain",{"$nulls":3},"Satin Box - Top Logo (add $6)",null,"Mark & Tool - Etched Logo (add $6)"]
[{"$nulls":3},"CustomCapBlack HCN3456",null,"(BGG5383) Go-In! Stealth Beveled",null,"(SCL3723) Smoke Grey Pebble Grain",{"$nulls":3},"Satin Box - Top & Inside Logo (add $8)",null,"Mark & Tool - Color Logo (add $6)"]
[{"$nulls":3},"CustomCapNavy HCN4567",null,"(BGF4591) Fast Eddie Matte Nickel Beveled",null,"(SCL1422) Storm Grey Pebble Grain",{"$nulls":3},"Wood Piano Box - Inside Logo (add $25)"]
[{"$nulls":3},"CustomCapWhite HCN1234",null,"(BCE5413) Classic Gunmetal Beveled",null,"(SBC7745) Braided Charcoal"]
[{"$nulls":3},"CustomCapGrey HCN2345",null,"(BCE4485) Classic Brushed Nickel Beveled",null,"(SAL0913) Alligator Black (add $15)"]
[{"$nulls":5},"(BCE5390) Classic Stealth Beveled",null,"(SAL3747) Alligator Coffee (add $15)"]
[{"$nulls":5},"(BCE5949) Classic Aston Black",null,"(SNC1385) Newport Navy (less $5)"]
[{"$nulls":5},"(BCE5970) Classic Aston Pewter",null,"(SNC1354) Newport Black (less $5)"]
[{"$nulls":7},"(SNC1361) Newport Grey (less $5)"]
[{"$nulls":7},"Blue Ribbon"]
[{"$nulls":7},"Red Ribbon"]
[{"$nulls":7},"Navy Ribbon"]
[{"$nulls":3},"CustomBuckle",null,"Debossed",null,"Tan Ribbon"]
[{"$nulls":7},"Green Ribbon"]
[{"$nulls":3},"Embossed",null,"(BGG7783) Go-In! Blank Gunmetal Beveled",null,"Grey Ribbon  "]
[{"$nulls":3},"Debossed",null,"(BGG7790) Go-In! Blank Nickel Beveled",null,"Black Ribbon  "]
[{"$nulls":3},"Etched",null,"(BCE7813) Classic Blank Gunmetal Beveled"]
[{"$nulls":3},"ColorPrint",null,"(BCE7806) Classic Blank Nickel Beveled"]
[{"$nulls":5},"(BGG5406) Go-In! Gunmetal Beveled"]
[{"$nulls":5},"(BGG4508) Go-In! Brushed Nickel Beveled"]
[{"$nulls":5},"(BGG1576) Go-In! Brass "]
[{"$nulls":5},"(BGG5383) Go-In! Stealth Beveled"]
[{"$nulls":5},"(BGF4591) Fast Eddie Matte Nickel Beveled"]
[{"$nulls":5},"(BCE5413) Classic Gunmetal Beveled"]
[{"$nulls":5},"(BCE4485) Classic Brushed Nickel Beveled"]
[{"$nulls":5},"(BCE5390) Classic Stealth Beveled"]
[{"$nulls":5},"(BCE5949) Classic Aston Black"]
[{"$nulls":5},"(BCE5970) Classic Aston Pewter"]
[{"$nulls":5},"(BCE0241) Classic Aston Brushed Nickel"]
[]
[]
[{"$nulls":5},"Etched"]
[]
[{"$nulls":5},"(BGG5406) Go-In! Gunmetal Beveled"]
[{"$nulls":5},"(BGG4508) Go-In! Brushed Nickel Beveled"]
[{"$nulls":5},"(BGG5383) Go-In! Stealth Beveled"]
[{"$nulls":5},"(BGF4591) Fast Eddie Matte Nickel Beveled"]
[{"$nulls":5},"(BCE5413) Classic Gunmetal Beveled"]
[{"$nulls":5},"(BCE4485) Classic Brushed Nickel Beveled"]
[{"$nulls":5},"(BCE5390) Classic Stealth Beveled"]
[{"$nulls":5},"(BCE5949) Classic Aston Black"]
[{"$nulls":5},"(BCE5970) Classic Aston Pewter"]
[{"$nulls":5},"(BCE5963) Eagle White (Color Print Only)"]
[{"$nulls":5},"(BCE5956) Eagle Black (Color Print Only)"]
{"$rows_empty":9}
[{"$nulls":5},"ColorPrint"]
[]
[{"$nulls":5},"(BGG5406) Go-In! Gunmetal Beveled"]
[{"$nulls":5},"(BGG4508) Go-In! Brushed Nickel Beveled"]
[{"$nulls":5},"(BGG5383) Go-In! Stealth Beveled"]
[{"$nulls":5},"(BGF4591) Fast Eddie Matte Nickel Beveled"]
[{"$nulls":5},"(BCE5413) Classic Gunmetal Beveled"]
[{"$nulls":5},"(BCE4485) Classic Brushed Nickel Beveled"]
[{"$nulls":5},"(BCE5390) Classic Stealth Beveled"]
[{"$nulls":5},"(BCE5949) Classic Aston Black"]
[{"$nulls":5},"(BCE5970) Classic Aston Pewter"]
[{"$nulls":5},"(BCE5963) Eagle White (Color Print Only)"]
[{"$nulls":5},"(BCE5956) Eagle Black (Color Print Only)"]
[]
[]
[]
[]
[]
[]
[{"$nulls":5},"StrapOnly"]
[]
[{"$nulls":5},"(BGG5406) Go-In! Gunmetal Beveled"]
[{"$nulls":5},"(BGG4508) Go-In! Brushed Nickel Beveled"]
[{"$nulls":5},"(BGG5383) Go-In! Stealth Beveled"]
[{"$nulls":5},"(BGF4591) Fast Eddie Matte Nickel Beveled"]
[{"$nulls":5},"(BCE5413) Classic Gunmetal Beveled"]
[{"$nulls":5},"(BCE4485) Classic Brushed Nickel Beveled"]
[{"$nulls":5},"(BCE5390) Classic Stealth Beveled"]
[{"$nulls":5},"(BCE5949) Classic Aston Black"]
[{"$nulls":5},"(BCE5970) Classic Aston Pewter"]
[{"$nulls":5},"(BCE5963) Eagle White (Color Print Only)"]
[{"$nulls":5},"(BCE5956) Eagle Black (Color Print Only)"]
[]
[]
[]
[]
[]
[]
[{"$nulls":5},"CustomRibbon"]
[]
[{"$nulls":5},"(BCA2635) Aldrich Brass"]
[{"$nulls":5},"(BCM2634) Aldrich Satin Nickel"]
[]
[]
[]
[{"$nulls":5},"CustomBuckleList"]
[]
[{"$nulls":5},"(BGG7783) Go-In! Blank Gunmetal Beveled"]
[{"$nulls":5},"(BGG7790) Go-In! Blank Nickel Beveled"]
[{"$nulls":5},"(BCE7813) Classic Blank Gunmetal Beveled"]
[{"$nulls":5},"(BCE7806) Classic Blank Nickel Beveled"]
[{"$nulls":5},"(BGG5406) Go-In! Gunmetal Beveled"]
[{"$nulls":5},"(BGG4508) Go-In! Brushed Nickel Beveled"]
[{"$nulls":5},"(BGG5383) Go-In! Stealth Beveled"]
[{"$nulls":5},"(BGF4591) Fast Eddie Matte Nickel Beveled"]
[{"$nulls":5},"(BCE5413) Classic Gunmetal Beveled"]
[{"$nulls":5},"(BCE4485) Classic Brushed Nickel Beveled"]
[{"$nulls":5},"(BCE5390) Classic Stealth Beveled"]
[{"$nulls":5},"(BCE5949) Classic Aston Black"]
[{"$nulls":5},"(BCE5970) Classic Aston Pewter"]
[{"$nulls":5},"(BCE5963) Eagle White (Color Print Only)"]
[{"$nulls":5},"(BCE5956) Eagle Black (Color Print Only)"]
[]
[]
[]
[null,"=IFERROR(IF(B34=ClassicBreakdown!$B$7,ClassicBreakdown!$G$5,IF('Order Form'!B34=ClassicBreakdown!$C$7,ClassicBreakdown!$G$5,IF('Order Form'!B34=ClassicBreakdown!$J$8,ClassicBreakdown!$L$7,IF('Order Form'!B34=ClassicBreakdown!$B$33,ClassicBreakdown!$D$32,IF('Order Form'!B34=ClassicBreakdown!$J$31,ClassicBreakdown!$L$30,0))))),\"MOQ\")"]

{"sheet":"Summary Sheet","index":4,"n_rows":175,"n_cols":5,"rows_kept":175,"hidden":true}
["Custom Order Form",null,"Customer Name:",{"$f":"'Order Form'!D13","v":0}]
["Order Summary",null,"Order Date:",{"$f":"+'Order Form'!D8","v":"00:00:00"}]
[null,null,"Customer PO:",{"$f":"+'Order Form'!D9","v":0}]
[]
["Customization","Buckle","Logo Placement","Item Code","Qty"]
["Etched","(BGG5406) Go-In! Gunmetal Beveled","Full (Center)",null,{"$f":"SUMIFS('Order Form'!$I$34:$I$67,'Order Form'!$B$34:$B$67,A6,'Order Form'!$C$34:$C$67,B6,'Order Form'!$D$34:$D$67,C6)","v":0}]
["Etched","(BGG4508) Go-In! Brushed Nickel Beveled","Full (Center)",null,{"$f":"SUMIFS('Order Form'!$I$34:$I$67,'Order Form'!$B$34:$B$67,A7,'Order Form'!$C$34:$C$67,B7,'Order Form'!$D$34:$D$67,C7)","v":0}]
["Etched","(BGG1576) Go-In! Brass ","Full (Center)",null,{"$f":"SUMIFS('Order Form'!$I$34:$I$67,'Order Form'!$B$34:$B$67,A8,'Order Form'!$C$34:$C$67,B8,'Order Form'!$D$34:$D$67,C8)","v":0}]
["Etched","(BGG5383) Go-In! Stealth Beveled","Full (Center)",null,{"$f":"SUMIFS('Order Form'!$I$34:$I$67,'Order Form'!$B$34:$B$67,A9,'Order Form'!$C$34:$C$67,B9,'Order Form'!$D$34:$D$67,C9)","v":0}]
["Etched","(BGG1835) Go-In! Matte Nickel*","Full (Center)",null,{"$f":"SUMIFS('Order Form'!$I$34:$I$67,'Order Form'!$B$34:$B$67,A10,'Order Form'!$C$34:$C$67,B10,'Order Form'!$D$34:$D$67,C10)","v":0}]
["Etched","(BGF4591) Fast Eddie Matte Nickel Beveled","Full (Center)",null,{"$f":"SUMIFS('Order Form'!$I$34:$I$67,'Order Form'!$B$34:$B$67,A11,'Order Form'!$C$34:$C$67,B11,'Order Form'!$D$34:$D$67,C11)","v":0}]
["Etched","(BCE5413) Classic Gunmetal Beveled","Full (Center)",null,{"$f":"SUMIFS('Order Form'!$I$34:$I$67,'Order Form'!$B$34:$B$67,A12,'Order Form'!$C$34:$C$67,B12,'Order Form'!$D$34:$D$67,C12)","v":0}]
["Etched","(BCE4485) Classic Brushed Nickel Beveled","Full (Center)",null,{"$f":"SUMIFS('Order Form'!$I$34:$I$67,'Order Form'!$B$34:$B$67,A13,'Order Form'!$C$34:$C$67,B13,'Order Form'!$D$34:$D$67,C13)","v":0}]
["Etched","(BCE1224) Classic Brass","Full (Center)",null,{"$f":"SUMIFS('Order Form'!$I$34:$I$67,'Order Form'!$B$34:$B$67,A14,'Order Form'!$C$34:$C$67,B14,'Order Form'!$D$34:$D$67,C14)","v":0}]
["Etched","(BCE5390) Classic Stealth Beveled","Full (Center)",null,{"$f":"SUMIFS('Order Form'!$I$34:$I$67,'Order Form'!$B$34:$B$67,A15,'Order Form'!$C$34:$C$67,B15,'Order Form'!$D$34:$D$67,C15)","v":0}]
["Etched","(BCE5949) Classic Aston Black","Full (Center)",null,{"$f":"SUMIFS('Order Form'!$I$34:$I$67,'Order Form'!$B$34:$B$67,A16,'Order Form'!$C$34:$C$67,B16,'Order Form'!$D$34:$D$67,C16)","v":0}]
["Etched","(BCE5970) Classic Aston Pewter","Full (Center)",null,{"$f":"SUMIFS('Order Form'!$I$34:$I$67,'Order Form'!$B$34:$B$67,A17,'Order Form'!$C$34:$C$67,B17,'Order Form'!$D$34:$D$67,C17)","v":0}]
["Etched","(BCE0241) Classic Aston Brushed Nickel","Full (Center)",null,{"$f":"SUMIFS('Order Form'!$I$34:$I$67,'Order Form'!$B$34:$B$67,A18,'Order Form'!$C$34:$C$67,B18,'Order Form'!$D$34:$D$67,C18)","v":0}]
["Etched","(BCE5963) Eagle White (Color Print Only)","Full (Center)",null,{"$f":"SUMIFS('Order Form'!$I$34:$I$67,'Order Form'!$B$34:$B$67,A19,'Order Form'!$C$34:$C$67,B19,'Order Form'!$D$34:$D$67,C19)","v":0}]
["Etched","(BCE5956) Eagle Black (Color Print Only)","Full (Center)",null,{"$f":"SUMIFS('Order Form'!$I$34:$I$67,'Order Form'!$B$34:$B$67,A20,'Order Form'!$C$34:$C$67,B20,'Order Form'!$D$34:$D$67,C20)","v":0}]
["Etched","(BCE1842) Classic Matte Nickel*","Full (Center)",null,{"$f":"SUMIFS('Order Form'!$I$34:$I$67,'Order Form'!$B$34:$B$67,A21,'Order Form'!$C$34:$C$67,B21,'Order Form'!$D$34:$D$67,C21)","v":0}]
["Etched","(BGG5406) Go-In! Gunmetal Beveled","Lower Right Corner (Reduced)",null,{"$f":"SUMIFS('Order Form'!$I$34:$I$67,'Order Form'!$B$34:$B$67,A22,'Order Form'!$C$34:$C$67,B22,'Order Form'!$D$34:$D$67,C22)","v":0}]
["Etched","(BGG4508) Go-In! Brushed Nickel Beveled","Lower Right Corner (Reduced)",null,{"$f":"SUMIFS('Order Form'!$I$34:$I$67,'Order Form'!$B$34:$B$67,A23,'Order Form'!$C$34:$C$67,B23,'Order Form'!$D$34:$D$67,C23)","v":0}]
["Etched","(BGG1576) Go-In! Brass ","Lower Right Corner (Reduced)",null,{"$f":"SUMIFS('Order Form'!$I$34:$I$67,'Order Form'!$B$34:$B$67,A24,'Order Form'!$C$34:$C$67,B24,'Order Form'!$D$34:$D$67,C24)","v":0}]
["Etched","(BGG5383) Go-In! Stealth Beveled","Lower Right Corner (Reduced)",null,{"$f":"SUMIFS('Order Form'!$I$34:$I$67,'Order Form'!$B$34:$B$67,A25,'Order Form'!$C$34:$C$67,B25,'Order Form'!$D$34:$D$67,C25)","v":0}]
["Etched","(BGG1835) Go-In! Matte Nickel*","Lower Right Corner (Reduced)",null,{"$f":"SUMIFS('Order Form'!$I$34:$I$67,'Order Form'!$B$34:$B$67,A26,'Order Form'!$C$34:$C$67,B26,'Order Form'!$D$34:$D$67,C26)","v":0}]
["Etched","(BGF4591) Fast Eddie Matte Nickel Beveled","Lower Right Corner (Reduced)",null,{"$f":"SUMIFS('Order Form'!$I$34:$I$67,'Order Form'!$B$34:$B$67,A27,'Order Form'!$C$34:$C$67,B27,'Order Form'!$D$34:$D$67,C27)","v":0}]
["Etched","(BCE5413) Classic Gunmetal Beveled","Lower Right Corner (Reduced)",null,{"$f":"SUMIFS('Order Form'!$I$34:$I$67,'Order Form'!$B$34:$B$67,A28,'Order Form'!$C$34:$C$67,B28,'Order Form'!$D$34:$D$67,C28)","v":0}]
["Etched","(BCE4485) Classic Brushed Nickel Beveled","Lower Right Corner (Reduced)",null,{"$f":"SUMIFS('Order Form'!$I$34:$I$67,'Order Form'!$B$34:$B$67,A29,'Order Form'!$C$34:$C$67,B29,'Order Form'!$D$34:$D$67,C29)","v":0}]
["Etched","(BCE1224) Classic Brass","Lower Right Corner (Reduced)",null,{"$f":"SUMIFS('Order Form'!$I$34:$I$67,'Order Form'!$B$34:$B$67,A30,'Order Form'!$C$34:$C$67,B30,'Order Form'!$D$34:$D$67,C30)","v":0}]
["Etched","(BCE5390) Classic Stealth Beveled","Lower Right Corner (Reduced)",null,{"$f":"SUMIFS('Order Form'!$I$34:$I$67,'Order Form'!$B$34:$B$67,A31,'Order Form'!$C$34:$C$67,B31,'Order Form'!$D$34:$D$67,C31)","v":0}]
["Etched","(BCE5949) Classic Aston Black","Lower Right Corner (Reduced)",null,{"$f":"SUMIFS('Order Form'!$I$34:$I$67,'Order Form'!$B$34:$B$67,A32,'Order Form'!$C$34:$C$67,B32,'Order Form'!$D$34:$D$67,C32)","v":0}]
["Etched","(BCE5970) Classic Aston Pewter","Lower Right Corner (Reduced)",null,{"$f":"SUMIFS('Order Form'!$I$34:$I$67,'Order Form'!$B$34:$B$67,A33,'Order Form'!$C$34:$C$67,B33,'Order Form'!$D$34:$D$67,C33)","v":0}]
["Etched","(BCE0241) Classic Aston Brushed Nickel","Lower Right Corner (Reduced)",null,{"$f":"SUMIFS('Order Form'!$I$34:$I$67,'Order Form'!$B$34:$B$67,A34,'Order Form'!$C$34:$C$67,B34,'Order Form'!$D$34:$D$67,C34)","v":0}]
["Etched","(BCE5963) Eagle White (Color Print Only)","Lower Right Corner (Reduced)",null,{"$f":"SUMIFS('Order Form'!$I$34:$I$67,'Order Form'!$B$34:$B$67,A35,'Order Form'!$C$34:$C$67,B35,'Order Form'!$D$34:$D$67,C35)","v":0}]
["Etched","(BCE5956) Eagle Black (Color Print Only)","Lower Right Corner (Reduced)",null,{"$f":"SUMIFS('Order Form'!$I$34:$I$67,'Order Form'!$B$34:$B$67,A36,'Order Form'!$C$34:$C$67,B36,'Order Form'!$D$34:$D$67,C36)","v":0}]
["Etched","(BCE1842) Classic Matte Nickel*","Lower Right Corner (Reduced)",null,{"$f":"SUMIFS('Order Form'!$I$34:$I$67,'Order Form'!$B$34:$B$67,A37,'Order Form'!$C$34:$C$67,B37,'Order Form'!$D$34:$D$67,C37)","v":0}]
["Embossed","(BGG5406) Go-In! Gunmetal Beveled","Full (Center)",null,{"$f":"SUMIFS('Order Form'!$I$34:$I$67,'Order Form'!$B$34:$B$67,A38,'Order Form'!$C$34:$C$67,B38,'Order Form'!$D$34:$D$67,C38)","v":0}]
["Embossed","(BGG4508) Go-In! Brushed Nickel Beveled","Full (Center)",null,{"$f":"SUMIFS('Order Form'!$I$34:$I$67,'Order Form'!$B$34:$B$67,A39,'Order Form'!$C$34:$C$67,B39,'Order Form'!$D$34:$D$67,C39)","v":0}]
["Embossed","(BGG1576) Go-In! Brass ","Full (Center)",null,{"$f":"SUMIFS('Order Form'!$I$34:$I$67,'Order Form'!$B$34:$B$67,A40,'Order Form'!$C$34:$C$67,B40,'Order Form'!$D$34:$D$67,C40)","v":0}]
["Embossed","(BGG5383) Go-In! Stealth Beveled","Full (Center)",null,{"$f":"SUMIFS('Order Form'!$I$34:$I$67,'Order Form'!$B$34:$B$67,A41,'Order Form'!$C$34:$C$67,B41,'Order Form'!$D$34:$D$67,C41)","v":0}]
["Embossed","(BGG1835) Go-In! Matte Nickel*","Full (Center)",null,{"$f":"SUMIFS('Order Form'!$I$34:$I$67,'Order Form'!$B$34:$B$67,A42,'Order Form'!$C$34:$C$67,B42,'Order Form'!$D$34:$D$67,C42)","v":0}]
["Embossed","(BGF4591) Fast Eddie Matte Nickel Beveled","Full (Center)",null,{"$f":"SUMIFS('Order Form'!$I$34:$I$67,'Order Form'!$B$34:$B$67,A43,'Order Form'!$C$34:$C$67,B43,'Order Form'!$D$34:$D$67,C43)","v":0}]
["Embossed","(BCE5413) Classic Gunmetal Beveled","Full (Center)",null,{"$f":"SUMIFS('Order Form'!$I$34:$I$67,'Order Form'!$B$34:$B$67,A44,'Order Form'!$C$34:$C$67,B44,'Order Form'!$D$34:$D$67,C44)","v":0}]
["Embossed","(BCE4485) Classic Brushed Nickel Beveled","Full (Center)",null,{"$f":"SUMIFS('Order Form'!$I$34:$I$67,'Order Form'!$B$34:$B$67,A45,'Order Form'!$C$34:$C$67,B45,'Order Form'!$D$34:$D$67,C45)","v":0}]
["Embossed","(BCE1224) Classic Brass","Full (Center)",null,{"$f":"SUMIFS('Order Form'!$I$34:$I$67,'Order Form'!$B$34:$B$67,A46,'Order Form'!$C$34:$C$67,B46,'Order Form'!$D$34:$D$67,C46)","v":0}]
["Embossed","(BCE5390) Classic Stealth Beveled","Full (Center)",null,{"$f":"SUMIFS('Order Form'!$I$34:$I$67,'Order Form'!$B$34:$B$67,A47,'Order Form'!$C$34:$C$67,B47,'Order Form'!$D$34:$D$67,C47)","v":0}]
["Embossed","(BCE5949) Classic Aston Black","Full (Center)",null,{"$f":"SUMIFS('Order Form'!$I$34:$I$67,'Order Form'!$B$34:$B$67,A48,'Order Form'!$C$34:$C$67,B48,'Order Form'!$D$34:$D$67,C48)","v":0}]
["Embossed","(BCE5970) Classic Aston Pewter","Full (Center)",null,{"$f":"SUMIFS('Order Form'!$I$34:$I$67,'Order Form'!$B$34:$B$67,A49,'Order Form'!$C$34:$C$67,B49,'Order Form'!$D$34:$D$67,C49)","v":0}]
["Embossed","(BCE0241) Classic Aston Brushed Nickel","Full (Center)",null,{"$f":"SUMIFS('Order Form'!$I$34:$I$67,'Order Form'!$B$34:$B$67,A50,'Order Form'!$C$34:$C$67,B50,'Order Form'!$D$34:$D$67,C50)","v":0}]
["Embossed","(BCE5963) Eagle White (Color Print Only)","Full (Center)",null,{"$f":"SUMIFS('Order Form'!$I$34:$I$67,'Order Form'!$B$34:$B$67,A51,'Order Form'!$C$34:$C$67,B51,'Order Form'!$D$34:$D$67,C51)","v":0}]
["Embossed","(BCE5956) Eagle Black (Color Print Only)","Full (Center)",null,{"$f":"SUMIFS('Order Form'!$I$34:$I$67,'Order Form'!$B$34:$B$67,A52,'Order Form'!$C$34:$C$67,B52,'Order Form'!$D$34:$D$67,C52)","v":0}]
["Embossed","(BCE1842) Classic Matte Nickel*","Full (Center)",null,{"$f":"SUMIFS('Order Form'!$I$34:$I$67,'Order Form'!$B$34:$B$67,A53,'Order Form'!$C$34:$C$67,B53,'Order Form'!$D$34:$D$67,C53)","v":0}]
["Embossed","(BGG5406) Go-In! Gunmetal Beveled","Lower Right Corner (Reduced)",null,{"$f":"SUMIFS('Order Form'!$I$34:$I$67,'Order Form'!$B$34:$B$67,A54,'Order Form'!$C$34:$C$67,B54,'Order Form'!$D$34:$D$67,C54)","v":0}]
["Embossed","(BGG4508) Go-In! Brushed Nickel Beveled","Lower Right Corner (Reduced)",null,{"$f":"SUMIFS('Order Form'!$I$34:$I$67,'Order Form'!$B$34:$B$67,A55,'Order Form'!$C$34:$C$67,B55,'Order Form'!$D$34:$D$67,C55)","v":0}]
["Embossed","(BGG1576) Go-In! Brass ","Lower Right Corner (Reduced)",null,{"$f":"SUMIFS('Order Form'!$I$34:$I$67,'Order Form'!$B$34:$B$67,A56,'Order Form'!$C$34:$C$67,B56,'Order Form'!$D$34:$D$67,C56)","v":0}]
["Embossed","(BGG5383) Go-In! Stealth Beveled","Lower Right Corner (Reduced)",null,{"$f":"SUMIFS('Order Form'!$I$34:$I$67,'Order Form'!$B$34:$B$67,A57,'Order Form'!$C$34:$C$67,B57,'Order Form'!$D$34:$D$67,C57)","v":0}]
["Embossed","(BGG1835) Go-In! Matte Nickel*","Lower Right Corner (Reduced)",null,{"$f":"SUMIFS('Order Form'!$I$34:$I$67,'Order Form'!$B$34:$B$67,A58,'Order Form'!$C$34:$C$67,B58,'Order Form'!$D$34:$D$67,C58)","v":0}]
["Embossed","(BGF4591) Fast Eddie Matte Nickel Beveled","Lower Right Corner (Reduced)",null,{"$f":"SUMIFS('Order Form'!$I$34:$I$67,'Order Form'!$B$34:$B$67,A59,'Order Form'!$C$34:$C$67,B59,'Order Form'!$D$34:$D$67,C59)","v":0}]
["Embossed","(BCE5413) Classic Gunmetal Beveled","Lower Right Corner (Reduced)",null,{"$f":"SUMIFS('Order Form'!$I$34:$I$67,'Order Form'!$B$34:$B$67,A60,'Order Form'!$C$34:$C$67,B60,'Order Form'!$D$34:$D$67,C60)","v":0}]
["Embossed","(BCE4485) Classic Brushed Nickel Beveled","Lower Right Corner (Reduced)",null,{"$f":"SUMIFS('Order Form'!$I$34:$I$67,'Order Form'!$B$34:$B$67,A61,'Order Form'!$C$34:$C$67,B61,'Order Form'!$D$34:$D$67,C61)","v":0}]
["Embossed","(BCE1224) Classic Brass","Lower Right Corner (Reduced)",null,{"$f":"SUMIFS('Order Form'!$I$34:$I$67,'Order Form'!$B$34:$B$67,A62,'Order Form'!$C$34:$C$67,B62,'Order Form'!$D$34:$D$67,C62)","v":0}]
["Embossed","(BCE5390) Classic Stealth Beveled","Lower Right Corner (Reduced)",null,{"$f":"SUMIFS('Order Form'!$I$34:$I$67,'Order Form'!$B$34:$B$67,A63,'Order Form'!$C$34:$C$67,B63,'Order Form'!$D$34:$D$67,C63)","v":0}]
["Embossed","(BCE5949) Classic Aston Black","Lower Right Corner (Reduced)",null,{"$f":"SUMIFS('Order Form'!$I$34:$I$67,'Order Form'!$B$34:$B$67,A64,'Order Form'!$C$34:$C$67,B64,'Order Form'!$D$34:$D$67,C64)","v":0}]
["Embossed","(BCE5970) Classic Aston Pewter","Lower Right Corner (Reduced)",null,{"$f":"SUMIFS('Order Form'!$I$34:$I$67,'Order Form'!$B$34:$B$67,A65,'Order Form'!$C$34:$C$67,B65,'Order Form'!$D$34:$D$67,C65)","v":0}]
["Embossed","(BCE0241) Classic Aston Brushed Nickel","Lower Right Corner (Reduced)",null,{"$f":"SUMIFS('Order Form'!$I$34:$I$67,'Order Form'!$B$34:$B$67,A66,'Order Form'!$C$34:$C$67,B66,'Order Form'!$D$34:$D$67,C66)","v":0}]
["Embossed","(BCE5963) Eagle White (Color Print Only)","Lower Right Corner (Reduced)",null,{"$f":"SUMIFS('Order Form'!$I$34:$I$67,'Order Form'!$B$34:$B$67,A67,'Order Form'!$C$34:$C$67,B67,'Order Form'!$D$34:$D$67,C67)","v":0}]
["Embossed","(BCE5956) Eagle Black (Color Print Only)","Lower Right Corner (Reduced)",null,{"$f":"SUMIFS('Order Form'!$I$34:$I$67,'Order Form'!$B$34:$B$67,A68,'Order Form'!$C$34:$C$67,B68,'Order Form'!$D$34:$D$67,C68)","v":0}]
["Embossed","(BCE1842) Classic Matte Nickel*","Lower Right Corner (Reduced)",null,{"$f":"SUMIFS('Order Form'!$I$34:$I$67,'Order Form'!$B$34:$B$67,A69,'Order Form'!$C$34:$C$67,B69,'Order Form'!$D$34:$D$67,C69)","v":0}]
["ColorPrint","(BGG5406) Go-In! Gunmetal Beveled","Full (Center)",null,{"$f":"SUMIFS('Order Form'!$I$34:$I$67,'Order Form'!$B$34:$B$67,A70,'Order Form'!$C$34:$C$67,B70,'Order Form'!$D$34:$D$67,C70)","v":0}]
["ColorPrint","(BGG4508) Go-In! Brushed Nickel Beveled","Full (Center)",null,{"$f":"SUMIFS('Order Form'!$I$34:$I$67,'Order Form'!$B$34:$B$67,A71,'Order Form'!$C$34:$C$67,B71,'Order Form'!$D$34:$D$67,C71)","v":0}]
["ColorPrint","(BGG1576) Go-In! Brass ","Full (Center)",null,{"$f":"SUMIFS('Order Form'!$I$34:$I$67,'Order Form'!$B$34:$B$67,A72,'Order Form'!$C$34:$C$67,B72,'Order Form'!$D$34:$D$67,C72)","v":0}]
["ColorPrint","(BGG5383) Go-In! Stealth Beveled","Full (Center)",null,{"$f":"SUMIFS('Order Form'!$I$34:$I$67,'Order Form'!$B$34:$B$67,A73,'Order Form'!$C$34:$C$67,B73,'Order Form'!$D$34:$D$67,C73)","v":0}]
["ColorPrint","(BGG1835) Go-In! Matte Nickel*","Full (Center)",null,{"$f":"SUMIFS('Order Form'!$I$34:$I$67,'Order Form'!$B$34:$B$67,A74,'Order Form'!$C$34:$C$67,B74,'Order Form'!$D$34:$D$67,C74)","v":0}]
["ColorPrint","(BGF4591) Fast Eddie Matte Nickel Beveled","Full (Center)",null,{"$f":"SUMIFS('Order Form'!$I$34:$I$67,'Order Form'!$B$34:$B$67,A75,'Order Form'!$C$34:$C$67,B75,'Order Form'!$D$34:$D$67,C75)","v":0}]
["ColorPrint","(BCE5413) Classic Gunmetal Beveled","Full (Center)",null,{"$f":"SUMIFS('Order Form'!$I$34:$I$67,'Order Form'!$B$34:$B$67,A76,'Order Form'!$C$34:$C$67,B76,'Order Form'!$D$34:$D$67,C76)","v":0}]
["ColorPrint","(BCE4485) Classic Brushed Nickel Beveled","Full (Center)",null,{"$f":"SUMIFS('Order Form'!$I$34:$I$67,'Order Form'!$B$34:$B$67,A77,'Order Form'!$C$34:$C$67,B77,'Order Form'!$D$34:$D$67,C77)","v":0}]
["ColorPrint","(BCE1224) Classic Brass","Full (Center)",null,{"$f":"SUMIFS('Order Form'!$I$34:$I$67,'Order Form'!$B$34:$B$67,A78,'Order Form'!$C$34:$C$67,B78,'Order Form'!$D$34:$D$67,C78)","v":0}]
["ColorPrint","(BCE5390) Classic Stealth Beveled","Full (Center)",null,{"$f":"SUMIFS('Order Form'!$I$34:$I$67,'Order Form'!$B$34:$B$67,A79,'Order Form'!$C$34:$C$67,B79,'Order Form'!$D$34:$D$67,C79)","v":0}]
["ColorPrint","(BCE5949) Classic Aston Black","Full (Center)",null,{"$f":"SUMIFS('Order Form'!$I$34:$I$67,'Order Form'!$B$34:$B$67,A80,'Order Form'!$C$34:$C$67,B80,'Order Form'!$D$34:$D$67,C80)","v":0}]
["ColorPrint","(BCE5970) Classic Aston Pewter","Full (Center)",null,{"$f":"SUMIFS('Order Form'!$I$34:$I$67,'Order Form'!$B$34:$B$67,A81,'Order Form'!$C$34:$C$67,B81,'Order Form'!$D$34:$D$67,C81)","v":0}]
["ColorPrint","(BCE0241) Classic Aston Brushed Nickel","Full (Center)",null,{"$f":"SUMIFS('Order Form'!$I$34:$I$67,'Order Form'!$B$34:$B$67,A82,'Order Form'!$C$34:$C$67,B82,'Order Form'!$D$34:$D$67,C82)","v":0}]
["ColorPrint","(BCE5963) Eagle White (Color Print Only)","Full (Center)",null,{"$f":"SUMIFS('Order Form'!$I$34:$I$67,'Order Form'!$B$34:$B$67,A83,'Order Form'!$C$34:$C$67,B83,'Order Form'!$D$34:$D$67,C83)","v":0}]
["ColorPrint","(BCE5956) Eagle Black (Color Print Only)","Full (Center)",null,{"$f":"SUMIFS('Order Form'!$I$34:$I$67,'Order Form'!$B$34:$B$67,A84,'Order Form'!$C$34:$C$67,B84,'Order Form'!$D$34:$D$67,C84)","v":0}]
["ColorPrint","(BCE1842) Classic Matte Nickel*","Full (Center)",null,{"$f":"SUMIFS('Order Form'!$I$34:$I$67,'Order Form'!$B$34:$B$67,A85,'Order Form'!$C$34:$C$67,B85,'Order Form'!$D$34:$D$67,C85)","v":0}]
["ColorPrint","(BGG5406) Go-In! Gunmetal Beveled","Lower Right Corner (Reduced)",null,{"$f":"SUMIFS('Order Form'!$I$34:$I$67,'Order Form'!$B$34:$B$67,A86,'Order Form'!$C$34:$C$67,B86,'Order Form'!$D$34:$D$67,C86)","v":0}]
["ColorPrint","(BGG4508) Go-In! Brushed Nickel Beveled","Lower Right Corner (Reduced)",null,{"$f":"SUMIFS('Order Form'!$I$34:$I$67,'Order Form'!$B$34:$B$67,A87,'Order Form'!$C$34:$C$67,B87,'Order Form'!$D$34:$D$67,C87)","v":0}]
["ColorPrint","(BGG1576) Go-In! Brass ","Lower Right Corner (Reduced)",null,{"$f":"SUMIFS('Order Form'!$I$34:$I$67,'Order Form'!$B$34:$B$67,A88,'Order Form'!$C$34:$C$67,B88,'Order Form'!$D$34:$D$67,C88)","v":0}]
["ColorPrint","(BGG5383) Go-In! Stealth Beveled","Lower Right Corner (Reduced)",null,{"$f":"SUMIFS('Order Form'!$I$34:$I$67,'Order Form'!$B$34:$B$67,A89,'Order Form'!$C$34:$C$67,B89,'Order Form'!$D$34:$D$67,C89)","v":0}]
["ColorPrint","(BGG1835) Go-In! Matte Nickel*","Lower Right Corner (Reduced)",null,{"$f":"SUMIFS('Order Form'!$I$34:$I$67,'Order Form'!$B$34:$B$67,A90,'Order Form'!$C$34:$C$67,B90,'Order Form'!$D$34:$D$67,C90)","v":0}]
["ColorPrint","(BGF4591) Fast Eddie Matte Nickel Beveled","Lower Right Corner (Reduced)",null,{"$f":"SUMIFS('Order Form'!$I$34:$I$67,'Order Form'!$B$34:$B$67,A91,'Order Form'!$C$34:$C$67,B91,'Order Form'!$D$34:$D$67,C91)","v":0}]
["ColorPrint","(BCE5413) Classic Gunmetal Beveled","Lower Right Corner (Reduced)",null,{"$f":"SUMIFS('Order Form'!$I$34:$I$67,'Order Form'!$B$34:$B$67,A92,'Order Form'!$C$34:$C$67,B92,'Order Form'!$D$34:$D$67,C92)","v":0}]
["ColorPrint","(BCE4485) Classic Brushed Nickel Beveled","Lower Right Corner (Reduced)",null,{"$f":"SUMIFS('Order Form'!$I$34:$I$67,'Order Form'!$B$34:$B$67,A93,'Order Form'!$C$34:$C$67,B93,'Order Form'!$D$34:$D$67,C93)","v":0}]
["ColorPrint","(BCE1224) Classic Brass","Lower Right Corner (Reduced)",null,{"$f":"SUMIFS('Order Form'!$I$34:$I$67,'Order Form'!$B$34:$B$67,A94,'Order Form'!$C$34:$C$67,B94,'Order Form'!$D$34:$D$67,C94)","v":0}]
["ColorPrint","(BCE5390) Classic Stealth Beveled","Lower Right Corner (Reduced)",null,{"$f":"SUMIFS('Order Form'!$I$34:$I$67,'Order Form'!$B$34:$B$67,A95,'Order Form'!$C$34:$C$67,B95,'Order Form'!$D$34:$D$67,C95)","v":0}]
["ColorPrint","(BCE5949) Classic Aston Black","Lower Right Corner (Reduced)",null,{"$f":"SUMIFS('Order Form'!$I$34:$I$67,'Order Form'!$B$34:$B$67,A96,'Order Form'!$C$34:$C$67,B96,'Order Form'!$D$34:$D$67,C96)","v":0}]
["ColorPrint","(BCE5970) Classic Aston Pewter","Lower Right Corner (Reduced)",null,{"$f":"SUMIFS('Order Form'!$I$34:$I$67,'Order Form'!$B$34:$B$67,A97,'Order Form'!$C$34:$C$67,B97,'Order Form'!$D$34:$D$67,C97)","v":0}]
["ColorPrint","(BCE0241) Classic Aston Brushed Nickel","Lower Right Corner (Reduced)",null,{"$f":"SUMIFS('Order Form'!$I$34:$I$67,'Order Form'!$B$34:$B$67,A98,'Order Form'!$C$34:$C$67,B98,'Order Form'!$D$34:$D$67,C98)","v":0}]
["ColorPrint","(BCE5963) Eagle White (Color Print Only)","Lower Right Corner (Reduced)",null,{"$f":"SUMIFS('Order Form'!$I$34:$I$67,'Order Form'!$B$34:$B$67,A99,'Order Form'!$C$34:$C$67,B99,'Order Form'!$D$34:$D$67,C99)","v":0}]
["ColorPrint","(BCE5956) Eagle Black (Color Print Only)","Lower Right Corner (Reduced)",null,{"$f":"SUMIFS('Order Form'!$I$34:$I$67,'Order Form'!$B$34:$B$67,A100,'Order Form'!$C$34:$C$67,B100,'Order Form'!$D$34:$D$67,C100)","v":0}]
["ColorPrint","(BCE1842) Classic Matte Nickel*","Lower Right Corner (Reduced)",null,{"$f":"SUMIFS('Order Form'!$I$34:$I$67,'Order Form'!$B$34:$B$67,A101,'Order Form'!$C$34:$C$67,B101,'Order Form'!$D$34:$D$67,C101)","v":0}]
["Debossed","(BGG5406) Go-In! Gunmetal Beveled","Full (Center)",null,{"$f":"SUMIFS('Order Form'!$I$34:$I$67,'Order Form'!$B$34:$B$67,A102,'Order Form'!$C$34:$C$67,B102,'Order Form'!$D$34:$D$67,C102)","v":0}]
["Debossed","(BGG4508) Go-In! Brushed Nickel Beveled","Full (Center)",null,{"$f":"SUMIFS('Order Form'!$I$34:$I$67,'Order Form'!$B$34:$B$67,A103,'Order Form'!$C$34:$C$67,B103,'Order Form'!$D$34:$D$67,C103)","v":0}]
["Debossed","(BGG1576) Go-In! Brass ","Full (Center)",null,{"$f":"SUMIFS('Order Form'!$I$34:$I$67,'Order Form'!$B$34:$B$67,A104,'Order Form'!$C$34:$C$67,B104,'Order Form'!$D$34:$D$67,C104)","v":0}]
["Debossed","(BGG5383) Go-In! Stealth Beveled","Full (Center)",null,{"$f":"SUMIFS('Order Form'!$I$34:$I$67,'Order Form'!$B$34:$B$67,A105,'Order Form'!$C$34:$C$67,B105,'Order Form'!$D$34:$D$67,C105)","v":0}]
["Debossed","(BGG1835) Go-In! Matte Nickel*","Full (Center)",null,{"$f":"SUMIFS('Order Form'!$I$34:$I$67,'Order Form'!$B$34:$B$67,A106,'Order Form'!$C$34:$C$67,B106,'Order Form'!$D$34:$D$67,C106)","v":0}]
["Debossed","(BGF4591) Fast Eddie Matte Nickel Beveled","Full (Center)",null,{"$f":"SUMIFS('Order Form'!$I$34:$I$67,'Order Form'!$B$34:$B$67,A107,'Order Form'!$C$34:$C$67,B107,'Order Form'!$D$34:$D$67,C107)","v":0}]
["Debossed","(BCE5413) Classic Gunmetal Beveled","Full (Center)",null,{"$f":"SUMIFS('Order Form'!$I$34:$I$67,'Order Form'!$B$34:$B$67,A108,'Order Form'!$C$34:$C$67,B108,'Order Form'!$D$34:$D$67,C108)","v":0}]
["Debossed","(BCE4485) Classic Brushed Nickel Beveled","Full (Center)",null,{"$f":"SUMIFS('Order Form'!$I$34:$I$67,'Order Form'!$B$34:$B$67,A109,'Order Form'!$C$34:$C$67,B109,'Order Form'!$D$34:$D$67,C109)","v":0}]
["Debossed","(BCE1224) Classic Brass","Full (Center)",null,{"$f":"SUMIFS('Order Form'!$I$34:$I$67,'Order Form'!$B$34:$B$67,A110,'Order Form'!$C$34:$C$67,B110,'Order Form'!$D$34:$D$67,C110)","v":0}]
["Debossed","(BCE5390) Classic Stealth Beveled","Full (Center)",null,{"$f":"SUMIFS('Order Form'!$I$34:$I$67,'Order Form'!$B$34:$B$67,A111,'Order Form'!$C$34:$C$67,B111,'Order Form'!$D$34:$D$67,C111)","v":0}]
["Debossed","(BCE5949) Classic Aston Black","Full (Center)",null,{"$f":"SUMIFS('Order Form'!$I$34:$I$67,'Order Form'!$B$34:$B$67,A112,'Order Form'!$C$34:$C$67,B112,'Order Form'!$D$34:$D$67,C112)","v":0}]
["Debossed","(BCE5970) Classic Aston Pewter","Full (Center)",null,{"$f":"SUMIFS('Order Form'!$I$34:$I$67,'Order Form'!$B$34:$B$67,A113,'Order Form'!$C$34:$C$67,B113,'Order Form'!$D$34:$D$67,C113)","v":0}]
["Debossed","(BCE0241) Classic Aston Brushed Nickel","Full (Center)",null,{"$f":"SUMIFS('Order Form'!$I$34:$I$67,'Order Form'!$B$34:$B$67,A114,'Order Form'!$C$34:$C$67,B114,'Order Form'!$D$34:$D$67,C114)","v":0}]
["Debossed","(BCE5963) Eagle White (Color Print Only)","Full (Center)",null,{"$f":"SUMIFS('Order Form'!$I$34:$I$67,'Order Form'!$B$34:$B$67,A115,'Order Form'!$C$34:$C$67,B115,'Order Form'!$D$34:$D$67,C115)","v":0}]
["Debossed","(BCE5956) Eagle Black (Color Print Only)","Full (Center)",null,{"$f":"SUMIFS('Order Form'!$I$34:$I$67,'Order Form'!$B$34:$B$67,A116,'Order Form'!$C$34:$C$67,B116,'Order Form'!$D$34:$D$67,C116)","v":0}]
["Debossed","(BCE1842) Classic Matte Nickel*","Full (Center)",null,{"$f":"SUMIFS('Order Form'!$I$34:$I$67,'Order Form'!$B$34:$B$67,A117,'Order Form'!$C$34:$C$67,B117,'Order Form'!$D$34:$D$67,C117)","v":0}]
["Debossed","(BGG5406) Go-In! Gunmetal Beveled","Lower Right Corner (Reduced)",null,{"$f":"SUMIFS('Order Form'!$I$34:$I$67,'Order Form'!$B$34:$B$67,A118,'Order Form'!$C$34:$C$67,B118,'Order Form'!$D$34:$D$67,C118)","v":0}]
["Debossed","(BGG4508) Go-In! Brushed Nickel Beveled","Lower Right Corner (Reduced)",null,{"$f":"SUMIFS('Order Form'!$I$34:$I$67,'Order Form'!$B$34:$B$67,A119,'Order Form'!$C$34:$C$67,B119,'Order Form'!$D$34:$D$67,C119)","v":0}]
["Debossed","(BGG1576) Go-In! Brass ","Lower Right Corner (Reduced)",null,{"$f":"SUMIFS('Order Form'!$I$34:$I$67,'Order Form'!$B$34:$B$67,A120,'Order Form'!$C$34:$C$67,B120,'Order Form'!$D$34:$D$67,C120)","v":0}]
["Debossed","(BGG5383) Go-In! Stealth Beveled","Lower Right Corner (Reduced)",null,{"$f":"SUMIFS('Order Form'!$I$34:$I$67,'Order Form'!$B$34:$B$67,A121,'Order Form'!$C$34:$C$67,B121,'Order Form'!$D$34:$D$67,C121)","v":0}]
["Debossed","(BGG1835) Go-In! Matte Nickel*","Lower Right Corner (Reduced)",null,{"$f":"SUMIFS('Order Form'!$I$34:$I$67,'Order Form'!$B$34:$B$67,A122,'Order Form'!$C$34:$C$67,B122,'Order Form'!$D$34:$D$67,C122)","v":0}]
["Debossed","(BGF4591) Fast Eddie Matte Nickel Beveled","Lower Right Corner (Reduced)",null,{"$f":"SUMIFS('Order Form'!$I$34:$I$67,'Order Form'!$B$34:$B$67,A123,'Order Form'!$C$34:$C$67,B123,'Order Form'!$D$34:$D$67,C123)","v":0}]
["Debossed","(BCE5413) Classic Gunmetal Beveled","Lower Right Corner (Reduced)",null,{"$f":"SUMIFS('Order Form'!$I$34:$I$67,'Order Form'!$B$34:$B$67,A124,'Order Form'!$C$34:$C$67,B124,'Order Form'!$D$34:$D$67,C124)","v":0}]
["Debossed","(BCE4485) Classic Brushed Nickel Beveled","Lower Right Corner (Reduced)",null,{"$f":"SUMIFS('Order Form'!$I$34:$I$67,'Order Form'!$B$34:$B$67,A125,'Order Form'!$C$34:$C$67,B125,'Order Form'!$D$34:$D$67,C125)","v":0}]
["Debossed","(BCE1224) Classic Brass","Lower Right Corner (Reduced)",null,{"$f":"SUMIFS('Order Form'!$I$34:$I$67,'Order Form'!$B$34:$B$67,A126,'Order Form'!$C$34:$C$67,B126,'Order Form'!$D$34:$D$67,C126)","v":0}]
["Debossed","(BCE5390) Classic Stealth Beveled","Lower Right Corner (Reduced)",null,{"$f":"SUMIFS('Order Form'!$I$34:$I$67,'Order Form'!$B$34:$B$67,A127,'Order Form'!$C$34:$C$67,B127,'Order Form'!$D$34:$D$67,C127)","v":0}]
["Debossed","(BCE5949) Classic Aston Black","Lower Right Corner (Reduced)",null,{"$f":"SUMIFS('Order Form'!$I$34:$I$67,'Order Form'!$B$34:$B$67,A128,'Order Form'!$C$34:$C$67,B128,'Order Form'!$D$34:$D$67,C128)","v":0}]
["Debossed","(BCE5970) Classic Aston Pewter","Lower Right Corner (Reduced)",null,{"$f":"SUMIFS('Order Form'!$I$34:$I$67,'Order Form'!$B$34:$B$67,A129,'Order Form'!$C$34:$C$67,B129,'Order Form'!$D$34:$D$67,C129)","v":0}]
["Debossed","(BCE0241) Classic Aston Brushed Nickel","Lower Right Corner (Reduced)",null,{"$f":"SUMIFS('Order Form'!$I$34:$I$67,'Order Form'!$B$34:$B$67,A130,'Order Form'!$C$34:$C$67,B130,'Order Form'!$D$34:$D$67,C130)","v":0}]
["Debossed","(BCE5963) Eagle White (Color Print Only)","Lower Right Corner (Reduced)",null,{"$f":"SUMIFS('Order Form'!$I$34:$I$67,'Order Form'!$B$34:$B$67,A131,'Order Form'!$C$34:$C$67,B131,'Order Form'!$D$34:$D$67,C131)","v":0}]
["Debossed","(BCE5956) Eagle Black (Color Print Only)","Lower Right Corner (Reduced)",null,{"$f":"SUMIFS('Order Form'!$I$34:$I$67,'Order Form'!$B$34:$B$67,A132,'Order Form'!$C$34:$C$67,B132,'Order Form'!$D$34:$D$67,C132)","v":0}]
["Debossed","(BCE1842) Classic Matte Nickel*","Lower Right Corner (Reduced)",null,{"$f":"SUMIFS('Order Form'!$I$34:$I$67,'Order Form'!$B$34:$B$67,A133,'Order Form'!$C$34:$C$67,B133,'Order Form'!$D$34:$D$67,C133)","v":0}]
["CustomRibbon","Aldrich Brass","Full (Center)",null,{"$f":"SUMIFS('Order Form'!$I$34:$I$67,'Order Form'!$B$34:$B$67,A134,'Order Form'!$C$34:$C$67,B134,'Order Form'!$D$34:$D$67,C134)","v":0}]
["CustomRibbon","Aldrich Brass","Lower Right Corner (Reduced)",null,{"$f":"SUMIFS('Order Form'!$I$34:$I$67,'Order Form'!$B$34:$B$67,A135,'Order Form'!$C$34:$C$67,B135,'Order Form'!$D$34:$D$67,C135)","v":0}]
["CustomRibbon","Aldrich Matte Nickel","Full (Center)",null,{"$f":"SUMIFS('Order Form'!$I$34:$I$67,'Order Form'!$B$34:$B$67,A136,'Order Form'!$C$34:$C$67,B136,'Order Form'!$D$34:$D$67,C136)","v":0}]
["CustomRibbon","Aldrich Matte Nickel","Lower Right Corner (Reduced)",null,{"$f":"SUMIFS('Order Form'!$I$34:$I$67,'Order Form'!$B$34:$B$67,A137,'Order Form'!$C$34:$C$67,B137,'Order Form'!$D$34:$D$67,C137)","v":0}]
[null,null,"Strap","Item Code","Qty"]
[null,null,"(SEL0869) Smooth Black",null,{"$f":"SUMIF('Order Form'!$E$34:$E$53,C139,'Order Form'!$I$34:$I$53)","v":0}]
[null,null,"(SEL0760) Carbon Black",null,{"$f":"SUMIF('Order Form'!$E$34:$E$53,C140,'Order Form'!$I$34:$I$53)","v":0}]
[null,null,"(SEL4683) Espresso",null,{"$f":"SUMIF('Order Form'!$E$34:$E$53,C141,'Order Form'!$I$34:$I$53)","v":0}]
[null,null,"(SEL0753) Walnut Brown",null,{"$f":"SUMIF('Order Form'!$E$34:$E$53,C142,'Order Form'!$I$34:$I$53)","v":0}]
[null,null,"(SEL0906) Smooth White",null,{"$f":"SUMIF('Order Form'!$E$34:$E$53,C143,'Order Form'!$I$34:$I$53)","v":0}]
[null,null,"(SCL3617) Deep Sea Navy Pebble Grain",null,{"$f":"SUMIF('Order Form'!$E$34:$E$53,C144,'Order Form'!$I$34:$I$53)","v":0}]
[null,null,"(SCL3723) Smoke Grey Pebble Grain",null,{"$f":"SUMIF('Order Form'!$E$34:$E$53,C145,'Order Form'!$I$34:$I$53)","v":0}]
[null,null,"(SCL1422) Storm Grey Pebble Grain",null,{"$f":"SUMIF('Order Form'!$E$34:$E$53,C146,'Order Form'!$I$34:$I$53)","v":0}]
[null,null,"(SAL0913) Alligator Black (add $15)",null,{"$f":"SUMIF('Order Form'!$E$34:$E$53,C147,'Order Form'!$I$34:$I$53)","v":0}]
[null,null,"(SAL3747) Alligator Coffee (add $15)",null,{"$f":"SUMIF('Order Form'!$E$34:$E$53,C148,'Order Form'!$I$34:$I$53)","v":0}]
[null,null,"(SNC5123) Newport Navy (less $5)",null,{"$f":"SUMIF('Order Form'!$E$34:$E$53,C149,'Order Form'!$I$34:$I$53)","v":0}]
[null,null,"(SNC5109) Newport Black (less $5)",null,{"$f":"SUMIF('Order Form'!$E$34:$E$53,C150,'Order Form'!$I$34:$I$53)","v":0}]
[null,null,"(SNC5130) Newport Tan (less $5)",null,{"$f":"SUMIF('Order Form'!$E$34:$E$53,C151,'Order Form'!$I$34:$I$53)","v":0}]
[null,null,"(SNC5116) Newport Grey (less $5)",null,{"$f":"SUMIF('Order Form'!$E$34:$E$53,C152,'Order Form'!$I$34:$I$53)","v":0}]
[null,null,"Blue Ribbon",null,{"$f":"SUMIF('Order Form'!$E$34:$E$53,C153,'Order Form'!$I$34:$I$53)","v":0}]
[null,null,"Red Ribbon",null,{"$f":"SUMIF('Order Form'!$E$34:$E$53,C154,'Order Form'!$I$34:$I$53)","v":0}]
[null,null,"Navy Ribbon",null,{"$f":"SUMIF('Order Form'!$E$34:$E$53,C155,'Order Form'!$I$34:$I$53)","v":0}]
[null,null,"Tan Ribbon",null,{"$f":"SUMIF('Order Form'!$E$34:$E$53,C156,'Order Form'!$I$34:$I$53)","v":0}]
[null,null,"Green Ribbon",null,{"$f":"SUMIF('Order Form'!$E$34:$E$53,C157,'Order Form'!$I$34:$I$53)","v":0}]
[null,null,"Grey Ribbon (new for 2020)",null,{"$f":"SUMIF('Order Form'!$E$34:$E$53,C158,'Order Form'!$I$34:$I$53)","v":0}]
[null,null,"Presentation Box","Item Code","Qty"]
[null,null,"Poly Carbonate Box","100B",{"$f":"SUMIF('Order Form'!$F$34:$F$53,C160,'Order Form'!$I$34:$I$53)","v":0}]
[null,null,"Tournament Packaging",null,{"$f":"SUMIF('Order Form'!$F$34:$F$53,C161,'Order Form'!$I$34:$I$53)","v":0}]
[null,null,"Tourney Pkg w/ Logo (add $1)",null,{"$f":"SUMIF('Order Form'!$F$34:$F$53,C162,'Order Form'!$I$34:$I$53)","v":0}]
[null,null,"Velvet Bag (add $1)","Velvet ",{"$f":"SUMIF('Order Form'!$F$34:$F$53,C163,'Order Form'!$I$34:$I$53)","v":0}]
[null,null,"Poly Carbonate Logo Insert (add $2)","100B",{"$f":"SUMIF('Order Form'!$F$34:$F$53,C164,'Order Form'!$I$34:$I$53)","v":0}]
[null,null,"Satin Box - Top Logo (add $6)","Gift Box",{"$f":"SUMIF('Order Form'!$F$34:$F$53,C165,'Order Form'!$I$34:$I$53)","v":0}]
[null,null,"Satin Box - Top & Inside Logo (add $8)","Gift Box",{"$f":"SUMIF('Order Form'!$F$34:$F$53,C166,'Order Form'!$I$34:$I$53)","v":0}]
[null,null,"Wood Piano Box - Inside Logo (add $25)","101B",{"$f":"SUMIF('Order Form'!$F$34:$F$53,C167,'Order Form'!$I$34:$I$53)","v":0}]
[null,null,"Ball Mark / Tool",null,"Qty"]
[null,null,"Standard Ball Mark",null,{"$f":"SUMIF('Order Form'!$G$34:$G$53,C169,'Order Form'!$I$34:$I$53)","v":0}]
[null,null,"Ball Mark - Etched Logo (add $3)",null,{"$f":"SUMIF('Order Form'!$G$34:$G$53,C170,'Order Form'!$I$34:$I$53)","v":0}]
[null,null,"Ball Mark - Color Logo (add $3)",null,{"$f":"SUMIF('Order Form'!$G$34:$G$53,C171,'Order Form'!$I$34:$I$53)","v":0}]
[null,null,"Divot Tool - Etched Logo (add $3)",null,{"$f":"SUMIF('Order Form'!$G$34:$G$53,C172,'Order Form'!$I$34:$I$53)","v":0}]
[null,null,"Divot Tool - Color Logo (add $3)",null,{"$f":"SUMIF('Order Form'!$G$34:$G$53,C173,'Order Form'!$I$34:$I$53)","v":0}]
[null,null,"Mark & Tool - Etched Logo (add $6)",null,{"$f":"SUMIF('Order Form'!$G$34:$G$53,C174,'Order Form'!$I$34:$I$53)","v":0}]
[null,null,"Mark & Tool - Color Logo (add $6)",null,{"$f":"SUMIF('Order Form'!$G$34:$G$53,C175,'Order Form'!$I$34:$I$53)","v":0}]

{"sheet":"ClassicData","index":5,"n_rows":506,"n_cols":42,"rows_kept":506,"hidden":true}
[]
[]
[{"$nulls":4},"classic"]
[{"$nulls":9},"Embossed / Debossed",null,null,"Polished Plate",null,null,"Custom Ribbon",null,"Custom Caps"]
[{"$nulls":6},"Etched / Printed",null,null,"Price Level",null,null,"Price Level",null,null,"Price Level",null,"Price Level",null,null,"Strap",{"$nulls":3},"Presentation Box",null,null,"BM / Tool",{"$nulls":3},"StrapOnlyPricing "]
[null,"Price Levels",null,"Price Sumamry",null,null,"Price Level",null,null,"Qty","Price",null,"Qty","Price",null,"Qty","Price","Qty","Price",null,"Price Adjust",{"$nulls":3},"Price Adjust",null,null,"Price Adjust",{"$nulls":3},"Price Adjust",{"$nulls":8},"Strap Only OLD"]
[]
[null,"#1",null,"#1",{"v":38,"d":"38.00"},null,1,"#1",null,50,{"v":49,"d":"49.00"},null,200,{"v":33,"d":"33.00"},null,50,{"v":35,"d":"35.00"},12,{"v":15,"d":"15.00"},null,"(SEL0869) Smooth Black",0,null,null,"Poly Carbonate Box",0,null,"Standard Ball Mark",0,null,null,"(SEL0869) Smooth Black",{"v":20,"d":"20.00"},null,null,"#1","1-23",{"$nulls":3},"(SEL0760) Carbon Black",{"v":20,"d":"20.00"}]
[null,"#2",null,"#2",{"v":36,"d":"36.00"},null,{"$f":"+G8+1","v":2},"#1",null,51,{"v":49,"d":"49.00"},null,201,{"v":33,"d":"33.00"},null,51,{"v":35,"d":"35.00"},13,{"v":15,"d":"15.00"},null,"(SEL0760) Carbon Black",0,null,null,"Tournament Packaging",0,null,"Ball Mark - Etched Logo (add $3)",{"v":3,"d":"3.00"},null,null,"(SEL0760) Carbon Black",{"v":20,"d":"20.00"},null,null,"#2","24-99",{"$nulls":3},"(SEL0845) Carbon White",{"v":20,"d":"20.00"}]
[null,"#3",null,"#3",{"v":33,"d":"33.00"},null,{"$f":"+G9+1","v":3},"#1",null,52,{"v":49,"d":"49.00"},null,202,{"v":33,"d":"33.00"},null,52,{"v":35,"d":"35.00"},14,{"v":15,"d":"15.00"},null,"(SEL4683) Espresso",0,null,null,"Tourney Pkg w/ Logo (add $1)",{"v":1,"d":"1.00"},null,"Ball Mark - Color Logo (add $3)",{"v":3,"d":"3.00"},null,null,"(SEL4683) Espresso",{"v":20,"d":"20.00"},null,null,"#3","100-199",{"$nulls":3},"(SCL4270) Deep Sea",{"v":20,"d":"20.00"}]
[null,"#4",null,"#4",{"v":31,"d":"31.00"},null,4,"#1",null,53,{"v":49,"d":"49.00"},null,203,{"v":33,"d":"33.00"},null,53,{"v":35,"d":"35.00"},15,{"v":15,"d":"15.00"},null,"(SEL0753) Walnut Brown",0,null,null,"Velvet Bag (add $1)",{"v":1,"d":"1.00"},null,"Divot Tool - Etched Logo (add $3)",{"v":3,"d":"3.00"},null,null,"(SEL0753) Walnut Brown",{"v":20,"d":"20.00"},null,null,"#4","200-249",{"$nulls":3},"(SCL0715) Dublin Green",{"v":20,"d":"20.00"}]
[null,"#5",null,"#5",{"v":29,"d":"29.00"},null,5,"#1",null,54,{"v":49,"d":"49.00"},null,204,{"v":33,"d":"33.00"},null,54,{"v":35,"d":"35.00"},16,{"v":15,"d":"15.00"},null,"(SEL0906) Smooth White",0,null,null,"Poly Carbonate Logo Insert (add $2)",{"v":2,"d":"2.00"},null,"Divot Tool - Color Logo (add $3)",{"v":3,"d":"3.00"},null,null,"(SEL0906) Smooth White",{"v":20,"d":"20.00"},null,null,"#5","250-349",{"$nulls":3},"(SEL0852) Ebony Black",{"v":20,"d":"20.00"}]
[null,"#6",null,"#6",{"v":28,"d":"28.00"},null,6,"#1",null,55,{"v":49,"d":"49.00"},null,205,{"v":33,"d":"33.00"},null,55,{"v":35,"d":"35.00"},17,{"v":15,"d":"15.00"},null,"(SCL3617) Deep Sea Navy Pebble Grain",0,null,null,"Satin Box - Top Logo (add $6)",{"v":6,"d":"6.00"},null,"Mark & Tool - Etched Logo (add $6)",{"v":6,"d":"6.00"},null,null,"(SCL3617) Deep Sea Navy Pebble Grain",{"v":20,"d":"20.00"},null,null,"#6","350+",{"$nulls":3},"(SEL4683) Espresso",{"v":20,"d":"20.00"}]
[{"$nulls":6},7,"#1",null,56,{"v":49,"d":"49.00"},null,206,{"v":33,"d":"33.00"},null,56,{"v":35,"d":"35.00"},18,{"v":15,"d":"15.00"},null,"(SCL3723) Smoke Grey Pebble Grain",0,null,null,"Satin Box - Top & Inside Logo (add $8)",{"v":8,"d":"8.00"},null,"Mark & Tool - Color Logo (add $6)",{"v":6,"d":"6.00"},null,null,"(SCL3723) Smoke Grey Pebble Grain",{"v":20,"d":"20.00"},{"$nulls":7},"(SEL0890) Grid",{"v":20,"d":"20.00"}]
[{"$nulls":6},8,"#1",null,57,{"v":49,"d":"49.00"},null,207,{"v":33,"d":"33.00"},null,57,{"v":35,"d":"35.00"},19,{"v":15,"d":"15.00"},null,"(SCL1422) Storm Grey Pebble Grain",0,null,null,"Wood Piano Box - Inside Logo (add $25)",{"v":25,"d":"25.00"},{"$nulls":5},"(SCL1422) Storm Grey Pebble Grain",{"v":20,"d":"20.00"},{"$nulls":7},"(SCL0739) Lava Orange",{"v":20,"d":"20.00"}]
[null,"Cap Price (each)",null,null,{"v":15,"d":"15.00"},null,9,"#1",null,58,{"v":49,"d":"49.00"},null,208,{"v":33,"d":"33.00"},null,58,{"v":35,"d":"35.00"},20,{"v":15,"d":"15.00"},null,"(SAL0913) Alligator Black (add $15)",{"v":15,"d":"15.00"},{"$nulls":9},"(SAL0913) Alligator Black (add $15)",{"v":35,"d":"35.00"},{"$nulls":7},"(SZL4843) Patriot",{"v":20,"d":"20.00"}]
[{"$nulls":6},10,"#1",null,59,{"v":49,"d":"49.00"},null,209,{"v":33,"d":"33.00"},null,59,{"v":35,"d":"35.00"},21,{"v":15,"d":"15.00"},null,"(SAL3747) Alligator Coffee (add $15)",{"v":15,"d":"15.00"},{"$nulls":9},"(SAL3747) Alligator Coffee (add $15)",{"v":35,"d":"35.00"},{"$nulls":7},"(SCL4188) Pitch Black",{"v":20,"d":"20.00"}]
[{"$nulls":6},11,"#1",null,60,{"v":49,"d":"49.00"},null,210,{"v":33,"d":"33.00"},null,60,{"v":35,"d":"35.00"},22,{"v":15,"d":"15.00"},null,"(SNC1385) Newport Navy (less $5)",{"v":-5,"d":"(5.00)"},{"$nulls":9},"(SNC5123) Newport Navy (less $5)",{"v":15,"d":"15.00"},{"$nulls":7},"(SEL4171) Smoke Grey",{"v":20,"d":"20.00"}]
[{"$nulls":6},12,"#1",null,61,{"v":49,"d":"49.00"},null,211,{"v":33,"d":"33.00"},null,61,{"v":35,"d":"35.00"},23,{"v":15,"d":"15.00"},null,"(SNC1354) Newport Black (less $5)",{"v":-5,"d":"(5.00)"},{"$nulls":9},"(SNC5109) Newport Black (less $5)",{"v":15,"d":"15.00"},{"$nulls":7},"(SEL0869) Smooth Black",{"v":20,"d":"20.00"}]
[{"$nulls":6},13,"#1",null,62,{"v":49,"d":"49.00"},null,212,{"v":33,"d":"33.00"},null,62,{"v":35,"d":"35.00"},24,{"v":15,"d":"15.00"},null,"(SNC1361) Newport Grey (less $5)",{"v":-5,"d":"(5.00)"},{"$nulls":9},"(SNC5130) Newport Tan (less $5)",{"v":15,"d":"15.00"},{"$nulls":7},"(SEL0906) Smooth White",{"v":20,"d":"20.00"}]
[{"$nulls":6},14,"#1",null,63,{"v":49,"d":"49.00"},null,213,{"v":33,"d":"33.00"},null,63,{"v":35,"d":"35.00"},25,{"v":15,"d":"15.00"},null,"(SBC7745) Braided Charcoal",0,{"$nulls":9},"(SNC1750) Newport Grey (less $5)",{"v":15,"d":"15.00"},{"$nulls":7},"(SEL4263) Stainless Black",{"v":20,"d":"20.00"}]
[{"$nulls":6},15,"#1",null,64,{"v":49,"d":"49.00"},null,214,{"v":33,"d":"33.00"},null,64,{"v":35,"d":"35.00"},26,{"v":15,"d":"15.00"},null,"Blue Ribbon",0,{"$nulls":9},"Blue Ribbon",{"v":20,"d":"20.00"},{"$nulls":7},"(SEL6021) Stainless Grey",{"v":20,"d":"20.00"}]
[{"$nulls":6},16,"#1",null,65,{"v":49,"d":"49.00"},null,215,{"v":33,"d":"33.00"},null,65,{"v":35,"d":"35.00"},27,{"v":15,"d":"15.00"},null,"Red Ribbon",0,{"$nulls":9},"Red Ribbon",{"v":20,"d":"20.00"},{"$nulls":7},"(SCL4744) Storm Grey",{"v":20,"d":"20.00"}]
[{"$nulls":6},17,"#1",null,66,{"v":49,"d":"49.00"},null,216,{"v":33,"d":"33.00"},null,66,{"v":35,"d":"35.00"},28,{"v":15,"d":"15.00"},null,"Navy Ribbon",0,{"$nulls":9},"Navy Ribbon",{"v":20,"d":"20.00"},{"$nulls":7},"(SCL4195) Sunday Red",{"v":20,"d":"20.00"}]
[{"$nulls":6},18,"#1",null,67,{"v":49,"d":"49.00"},null,217,{"v":33,"d":"33.00"},null,67,{"v":35,"d":"35.00"},29,{"v":15,"d":"15.00"},null,"Tan Ribbon",0,{"$nulls":9},"Tan Ribbon",{"v":20,"d":"20.00"},{"$nulls":7},"(SCL7042) Sunny Yellow",{"v":20,"d":"20.00"}]
[{"$nulls":6},19,"#1",null,68,{"v":49,"d":"49.00"},null,218,{"v":33,"d":"33.00"},null,68,{"v":35,"d":"35.00"},30,{"v":15,"d":"15.00"},null,"Green Ribbon",0,{"$nulls":9},"Green Ribbon",{"v":20,"d":"20.00"},{"$nulls":7},"(SEL0883) Tex",{"v":20,"d":"20.00"}]
[{"$nulls":6},20,"#1",null,69,{"v":49,"d":"49.00"},null,219,{"v":33,"d":"33.00"},null,69,{"v":35,"d":"35.00"},31,{"v":15,"d":"15.00"},null,"Grey Ribbon",0,{"$nulls":9},"Grey Ribbon",{"v":20,"d":"20.00"},{"$nulls":7},"(SEL0753) Walnut Brown",{"v":20,"d":"20.00"}]
[{"$nulls":6},21,"#1",null,70,{"v":49,"d":"49.00"},null,220,{"v":33,"d":"33.00"},null,70,{"v":35,"d":"35.00"},32,{"v":15,"d":"15.00"},null,"Black Ribbon",0,{"$nulls":9},"Black Ribbon",{"v":20,"d":"20.00"},{"$nulls":7},"(SCL4201) Winner White",{"v":20,"d":"20.00"}]
[{"$nulls":6},22,"#1",null,71,{"v":49,"d":"49.00"},null,221,{"v":33,"d":"33.00"},null,71,{"v":35,"d":"35.00"},33,{"v":15,"d":"15.00"},null,"Grey Ribbon  ",0,{"$nulls":9},"Grey Ribbon (new for 2020)",{"v":20,"d":"20.00"},{"$nulls":7},"(SMC4232) Hampton - Deerwood (less $5)",{"v":20,"d":"20.00"}]
[{"$nulls":6},23,"#1",null,72,{"v":49,"d":"49.00"},null,222,{"v":33,"d":"33.00"},null,72,{"v":35,"d":"35.00"},34,{"v":15,"d":"15.00"},null,"Black Ribbon  ",0,{"$nulls":9},"Black Ribbon (new for 2020)",{"v":20,"d":"20.00"},{"$nulls":7},"(SMC4249) Hampton - Guinness (less $5)",{"v":20,"d":"20.00"}]
[{"$nulls":6},24,"#2",null,73,{"v":49,"d":"49.00"},null,223,{"v":33,"d":"33.00"},null,73,{"v":35,"d":"35.00"},35,{"v":15,"d":"15.00"},{"$nulls":21},"(SMC4256) Hampton - Nautical (less $5)",{"v":20,"d":"20.00"}]
[{"$nulls":6},25,"#2",null,74,{"v":49,"d":"49.00"},null,224,{"v":33,"d":"33.00"},null,74,{"v":35,"d":"35.00"},36,{"v":15,"d":"15.00"},{"$nulls":21},"(SNC6205) Newport - Admiral (less $5)",{"v":15,"d":"15.00"}]
[{"$nulls":6},26,"#2",null,75,{"v":49,"d":"49.00"},null,225,{"v":33,"d":"33.00"},null,75,{"v":35,"d":"35.00"},37,{"v":15,"d":"15.00"},{"$nulls":21},"(SNC0838) Newport - Americana (less $5)",{"v":10,"d":"10.00"}]
[{"$nulls":6},27,"#2",null,76,{"v":49,"d":"49.00"},null,226,{"v":33,"d":"33.00"},null,76,{"v":35,"d":"35.00"},38,{"v":15,"d":"15.00"},{"$nulls":21},"(SNC3624) Newport - Black (less $5)",{"v":10,"d":"10.00"}]
[{"$nulls":6},28,"#2",null,77,{"v":49,"d":"49.00"},null,227,{"v":33,"d":"33.00"},null,77,{"v":35,"d":"35.00"},39,{"v":15,"d":"15.00"},{"$nulls":21},"(SNC4218) Newport - Cedar (less $5)",{"v":10,"d":"10.00"}]
[{"$nulls":6},29,"#2",null,78,{"v":49,"d":"49.00"},null,228,{"v":33,"d":"33.00"},null,78,{"v":35,"d":"35.00"},40,{"v":15,"d":"15.00"},{"$nulls":21},"(SNC6182) Newport - Oliver (less $5)",{"v":15,"d":"15.00"}]
[{"$nulls":6},30,"#2",null,79,{"v":49,"d":"49.00"},null,229,{"v":33,"d":"33.00"},null,79,{"v":35,"d":"35.00"},41,{"v":15,"d":"15.00"},{"$nulls":21},"(SNC6199) Newport - Pacific (less $5)",{"v":15,"d":"15.00"}]
[{"$nulls":6},31,"#2",null,80,{"v":49,"d":"49.00"},null,230,{"v":33,"d":"33.00"},null,80,{"v":35,"d":"35.00"},42,{"v":15,"d":"15.00"},{"$nulls":21},"(SNC6175) Newport - Snow (less $5)",{"v":15,"d":"15.00"}]
[{"$nulls":6},32,"#2",null,81,{"v":49,"d":"49.00"},null,231,{"v":33,"d":"33.00"},null,81,{"v":35,"d":"35.00"},43,{"v":15,"d":"15.00"},{"$nulls":21},"(SAL0913) Alligator Black (add $20)",{"v":35,"d":"35.00"}]
[{"$nulls":6},33,"#2",null,82,{"v":49,"d":"49.00"},null,232,{"v":33,"d":"33.00"},null,82,{"v":35,"d":"35.00"},44,{"v":15,"d":"15.00"},{"$nulls":21},"(SAL3747) Alligator Coffee (add $20)",{"v":35,"d":"35.00"}]
[{"$nulls":6},34,"#2",null,83,{"v":49,"d":"49.00"},null,233,{"v":33,"d":"33.00"},null,83,{"v":35,"d":"35.00"},45,{"v":15,"d":"15.00"},{"$nulls":21},"(SAL7066) Alligator Grey (add $20)",{"v":35,"d":"35.00"}]
[{"$nulls":6},35,"#2",null,84,{"v":49,"d":"49.00"},null,234,{"v":33,"d":"33.00"},null,84,{"v":35,"d":"35.00"},46,{"v":15,"d":"15.00"},{"$nulls":21},"(SAL0944) Alligator Navy (add $20)",{"v":35,"d":"35.00"}]
[{"$nulls":6},36,"#2",null,85,{"v":49,"d":"49.00"},null,235,{"v":33,"d":"33.00"},null,85,{"v":35,"d":"35.00"},47,{"v":15,"d":"15.00"},{"$nulls":21},"(SAL0951) Alligator Tan (add $20)",{"v":35,"d":"35.00"}]
[{"$nulls":6},37,"#2",null,86,{"v":49,"d":"49.00"},null,236,{"v":33,"d":"33.00"},null,86,{"v":35,"d":"35.00"},48,{"v":15,"d":"15.00"},{"$nulls":21},"(SAL0821) Alligator Burgundy (add $20)",{"v":35,"d":"35.00"}]
[{"$nulls":6},38,"#2",null,87,{"v":49,"d":"49.00"},null,237,{"v":33,"d":"33.00"},null,87,{"v":35,"d":"35.00"},49,{"v":15,"d":"15.00"},{"$nulls":21},"(SAL0968) Alligator White (add $20)",{"v":35,"d":"35.00"}]
[{"$nulls":6},39,"#2",null,88,{"v":49,"d":"49.00"},null,238,{"v":33,"d":"33.00"},null,88,{"v":35,"d":"35.00"},50,{"v":15,"d":"15.00"},{"$nulls":21},"(SLL0784) Lizard Black (add $20)",{"v":35,"d":"35.00"}]
[{"$nulls":6},40,"#2",null,89,{"v":49,"d":"49.00"},null,239,{"v":33,"d":"33.00"},null,89,{"v":35,"d":"35.00"},51,{"v":15,"d":"15.00"},{"$nulls":21},"(SLL3648) Lizard Brown (add $20)",{"v":35,"d":"35.00"}]
[{"$nulls":6},41,"#2",null,90,{"v":49,"d":"49.00"},null,240,{"v":33,"d":"33.00"},null,90,{"v":35,"d":"35.00"},52,{"v":15,"d":"15.00"},{"$nulls":21},"(SLL3655) Lizard White (add $20)",{"v":35,"d":"35.00"}]
[{"$nulls":6},42,"#2",null,91,{"v":49,"d":"49.00"},null,241,{"v":33,"d":"33.00"},null,91,{"v":35,"d":"35.00"},53,{"v":15,"d":"15.00"},{"$nulls":21},"(WCC7011) Pebble Grain Aqua/Lime (add $20)",{"v":35,"d":"35.00"}]
[{"$nulls":6},43,"#2",null,92,{"v":49,"d":"49.00"},null,242,{"v":33,"d":"33.00"},null,92,{"v":35,"d":"35.00"},54,{"v":15,"d":"15.00"},{"$nulls":21},"(WCC7004) Pebble Grain Black/Aqua (add $20)",{"v":35,"d":"35.00"}]
[{"$nulls":6},44,"#2",null,93,{"v":49,"d":"49.00"},null,243,{"v":33,"d":"33.00"},null,93,{"v":35,"d":"35.00"},55,{"v":15,"d":"15.00"},{"$nulls":21},"(WCC6984) Pebble Grain Black/Cobalt (add $20)",{"v":35,"d":"35.00"}]
[{"$nulls":6},45,"#2",null,94,{"v":49,"d":"49.00"},null,244,{"v":33,"d":"33.00"},null,94,{"v":35,"d":"35.00"},56,{"v":15,"d":"15.00"},{"$nulls":21},"(WCC6953) Pebble Grain Black/Grey (add $20)",{"v":35,"d":"35.00"}]
[{"$nulls":6},46,"#2",null,95,{"v":49,"d":"49.00"},null,245,{"v":33,"d":"33.00"},null,95,{"v":35,"d":"35.00"},57,{"v":15,"d":"15.00"},{"$nulls":21},"(WCC7028) Pebble Grain Black/Orange (add $20)",{"v":35,"d":"35.00"}]
[{"$nulls":6},47,"#2",null,96,{"v":49,"d":"49.00"},null,246,{"v":33,"d":"33.00"},null,96,{"v":35,"d":"35.00"},58,{"v":15,"d":"15.00"},{"$nulls":21},"(WCC7035) Pebble Grain Camel/Orange (add $20)",{"v":35,"d":"35.00"}]
[{"$nulls":6},48,"#2",null,97,{"v":49,"d":"49.00"},null,247,{"v":33,"d":"33.00"},null,97,{"v":35,"d":"35.00"},59,{"v":15,"d":"15.00"},{"$nulls":21},"(WCC6991) Pebble Grain Cobalt/Grey (add $20)",{"v":35,"d":"35.00"}]
[{"$nulls":6},49,"#2",null,98,{"v":49,"d":"49.00"},null,248,{"v":33,"d":"33.00"},null,98,{"v":35,"d":"35.00"},60,{"v":15,"d":"15.00"},{"$nulls":21},"(WCC6977) Pebble Grain White/Grey (add $20)",{"v":35,"d":"35.00"}]
[{"$nulls":6},50,"#2",null,99,{"v":49,"d":"49.00"},null,249,{"v":33,"d":"33.00"},null,99,{"v":35,"d":"35.00"},61,{"v":15,"d":"15.00"}]
[{"$nulls":6},51,"#2",null,100,{"v":49,"d":"49.00"},null,250,{"v":30,"d":"30.00"},null,100,{"v":30,"d":"30.00"},62,{"v":15,"d":"15.00"}]
[{"$nulls":6},52,"#2",null,{"$f":"+J58+1","v":101},{"v":49,"d":"49.00"},null,251,{"v":30,"d":"30.00"},null,{"$f":"+P58+1","v":101},{"v":30,"d":"30.00"},63,{"v":15,"d":"15.00"}]
[{"$nulls":6},53,"#2",null,102,{"v":49,"d":"49.00"},null,252,{"v":30,"d":"30.00"},null,102,{"v":30,"d":"30.00"},64,{"v":15,"d":"15.00"}]
[{"$nulls":6},54,"#2",null,103,{"v":49,"d":"49.00"},null,253,{"v":30,"d":"30.00"},null,103,{"v":30,"d":"30.00"},65,{"v":15,"d":"15.00"}]
[{"$nulls":6},55,"#2",null,104,{"v":49,"d":"49.00"},null,254,{"v":30,"d":"30.00"},null,104,{"v":30,"d":"30.00"},66,{"v":15,"d":"15.00"}]
[{"$nulls":6},56,"#2",null,105,{"v":49,"d":"49.00"},null,255,{"v":30,"d":"30.00"},null,105,{"v":30,"d":"30.00"},67,{"v":15,"d":"15.00"}]
[{"$nulls":6},57,"#2",null,106,{"v":49,"d":"49.00"},null,256,{"v":30,"d":"30.00"},null,106,{"v":30,"d":"30.00"},68,{"v":15,"d":"15.00"}]
[{"$nulls":6},58,"#2",null,107,{"v":49,"d":"49.00"},null,257,{"v":30,"d":"30.00"},null,107,{"v":30,"d":"30.00"},69,{"v":15,"d":"15.00"}]
[{"$nulls":6},59,"#2",null,108,{"v":49,"d":"49.00"},null,258,{"v":30,"d":"30.00"},null,108,{"v":30,"d":"30.00"},70,{"v":15,"d":"15.00"}]
[{"$nulls":6},60,"#2",null,109,{"v":49,"d":"49.00"},null,259,{"v":30,"d":"30.00"},null,109,{"v":30,"d":"30.00"},71,{"v":15,"d":"15.00"}]
[{"$nulls":6},61,"#2",null,110,{"v":49,"d":"49.00"},null,260,{"v":30,"d":"30.00"},null,110,{"v":30,"d":"30.00"},72,{"v":15,"d":"15.00"}]
[{"$nulls":6},62,"#2",null,111,{"v":49,"d":"49.00"},null,261,{"v":30,"d":"30.00"},null,111,{"v":30,"d":"30.00"},73,{"v":15,"d":"15.00"}]
[{"$nulls":6},63,"#2",null,112,{"v":49,"d":"49.00"},null,262,{"v":30,"d":"30.00"},null,112,{"v":30,"d":"30.00"},74,{"v":15,"d":"15.00"}]
[{"$nulls":6},64,"#2",null,113,{"v":49,"d":"49.00"},null,263,{"v":30,"d":"30.00"},null,113,{"v":30,"d":"30.00"},75,{"v":15,"d":"15.00"}]
[{"$nulls":6},65,"#2",null,114,{"v":49,"d":"49.00"},null,264,{"v":30,"d":"30.00"},null,114,{"v":30,"d":"30.00"},76,{"v":15,"d":"15.00"}]
[{"$nulls":6},66,"#2",null,115,{"v":49,"d":"49.00"},null,265,{"v":30,"d":"30.00"},null,115,{"v":30,"d":"30.00"},77,{"v":15,"d":"15.00"}]
[{"$nulls":6},{"$f":"+G73+1","v":67},"#2",null,116,{"v":49,"d":"49.00"},null,266,{"v":30,"d":"30.00"},null,116,{"v":30,"d":"30.00"},78,{"v":15,"d":"15.00"}]
[{"$nulls":6},68,"#2",null,117,{"v":49,"d":"49.00"},null,267,{"v":30,"d":"30.00"},null,117,{"v":30,"d":"30.00"},79,{"v":15,"d":"15.00"}]
[{"$nulls":6},69,"#2",null,118,{"v":49,"d":"49.00"},null,268,{"v":30,"d":"30.00"},null,118,{"v":30,"d":"30.00"},80,{"v":15,"d":"15.00"}]
[{"$nulls":6},70,"#2",null,119,{"v":49,"d":"49.00"},null,269,{"v":30,"d":"30.00"},null,119,{"v":30,"d":"30.00"},81,{"v":15,"d":"15.00"}]
[{"$nulls":6},71,"#2",null,120,{"v":49,"d":"49.00"},null,270,{"v":30,"d":"30.00"},null,120,{"v":30,"d":"30.00"},82,{"v":15,"d":"15.00"}]
[{"$nulls":6},72,"#2",null,121,{"v":49,"d":"49.00"},null,271,{"v":30,"d":"30.00"},null,121,{"v":30,"d":"30.00"},83,{"v":15,"d":"15.00"}]
[{"$nulls":6},73,"#2",null,122,{"v":49,"d":"49.00"},null,272,{"v":30,"d":"30.00"},null,122,{"v":30,"d":"30.00"},84,{"v":15,"d":"15.00"}]
[{"$nulls":6},74,"#2",null,123,{"v":49,"d":"49.00"},null,273,{"v":30,"d":"30.00"},null,123,{"v":30,"d":"30.00"},85,{"v":15,"d":"15.00"}]
[{"$nulls":6},75,"#2",null,124,{"v":49,"d":"49.00"},null,274,{"v":30,"d":"30.00"},null,124,{"v":30,"d":"30.00"},86,{"v":15,"d":"15.00"}]
[{"$nulls":6},76,"#2",null,125,{"v":49,"d":"49.00"},null,275,{"v":30,"d":"30.00"},null,125,{"v":30,"d":"30.00"},87,{"v":15,"d":"15.00"}]
[{"$nulls":6},77,"#2",null,126,{"v":49,"d":"49.00"},null,276,{"v":30,"d":"30.00"},null,126,{"v":30,"d":"30.00"},88,{"v":15,"d":"15.00"}]
[{"$nulls":6},78,"#2",null,127,{"v":49,"d":"49.00"},null,277,{"v":30,"d":"30.00"},null,127,{"v":30,"d":"30.00"},89,{"v":15,"d":"15.00"}]
[{"$nulls":6},79,"#2",null,128,{"v":49,"d":"49.00"},null,278,{"v":30,"d":"30.00"},null,128,{"v":30,"d":"30.00"},90,{"v":15,"d":"15.00"}]
[{"$nulls":6},80,"#2",null,129,{"v":49,"d":"49.00"},null,279,{"v":30,"d":"30.00"},null,129,{"v":30,"d":"30.00"},91,{"v":15,"d":"15.00"}]
[{"$nulls":6},81,"#2",null,130,{"v":49,"d":"49.00"},null,280,{"v":30,"d":"30.00"},null,130,{"v":30,"d":"30.00"},92,{"v":15,"d":"15.00"}]
[{"$nulls":6},82,"#2",null,131,{"v":49,"d":"49.00"},null,281,{"v":30,"d":"30.00"},null,131,{"v":30,"d":"30.00"},93,{"v":15,"d":"15.00"}]
[{"$nulls":6},83,"#2",null,132,{"v":49,"d":"49.00"},null,282,{"v":30,"d":"30.00"},null,132,{"v":30,"d":"30.00"},94,{"v":15,"d":"15.00"}]
[{"$nulls":6},84,"#2",null,133,{"v":49,"d":"49.00"},null,283,{"v":30,"d":"30.00"},null,133,{"v":30,"d":"30.00"},95,{"v":15,"d":"15.00"}]
[{"$nulls":6},85,"#2",null,134,{"v":49,"d":"49.00"},null,284,{"v":30,"d":"30.00"},null,134,{"v":30,"d":"30.00"},96,{"v":15,"d":"15.00"}]
[{"$nulls":6},86,"#2",null,135,{"v":49,"d":"49.00"},null,285,{"v":30,"d":"30.00"},null,135,{"v":30,"d":"30.00"},97,{"v":15,"d":"15.00"}]
[{"$nulls":6},87,"#2",null,136,{"v":49,"d":"49.00"},null,286,{"v":30,"d":"30.00"},null,136,{"v":30,"d":"30.00"},98,{"v":15,"d":"15.00"}]
[{"$nulls":6},88,"#2",null,137,{"v":49,"d":"49.00"},null,287,{"v":30,"d":"30.00"},null,137,{"v":30,"d":"30.00"},99,{"v":15,"d":"15.00"}]
[{"$nulls":6},89,"#2",null,138,{"v":49,"d":"49.00"},null,288,{"v":30,"d":"30.00"},null,138,{"v":30,"d":"30.00"},100,{"v":15,"d":"15.00"}]
[{"$nulls":6},90,"#2",null,139,{"v":49,"d":"49.00"},null,289,{"v":30,"d":"30.00"},null,139,{"v":30,"d":"30.00"},101,{"v":15,"d":"15.00"}]
[{"$nulls":6},91,"#2",null,140,{"v":49,"d":"49.00"},null,290,{"v":30,"d":"30.00"},null,140,{"v":30,"d":"30.00"},102,{"v":15,"d":"15.00"}]
[{"$nulls":6},92,"#2",null,141,{"v":49,"d":"49.00"},null,291,{"v":30,"d":"30.00"},null,141,{"v":30,"d":"30.00"},103,{"v":15,"d":"15.00"}]
[{"$nulls":6},93,"#2",null,142,{"v":49,"d":"49.00"},null,292,{"v":30,"d":"30.00"},null,142,{"v":30,"d":"30.00"},104,{"v":15,"d":"15.00"}]
[{"$nulls":6},94,"#2",null,143,{"v":49,"d":"49.00"},null,293,{"v":30,"d":"30.00"},null,143,{"v":30,"d":"30.00"},105,{"v":15,"d":"15.00"}]
[{"$nulls":6},95,"#2",null,144,{"v":49,"d":"49.00"},null,294,{"v":30,"d":"30.00"},null,144,{"v":30,"d":"30.00"},106,{"v":15,"d":"15.00"}]
[{"$nulls":6},96,"#2",null,145,{"v":49,"d":"49.00"},null,295,{"v":30,"d":"30.00"},null,145,{"v":30,"d":"30.00"},107,{"v":15,"d":"15.00"}]
[{"$nulls":6},97,"#2",null,146,{"v":49,"d":"49.00"},null,296,{"v":30,"d":"30.00"},null,146,{"v":30,"d":"30.00"},108,{"v":15,"d":"15.00"}]
[{"$nulls":6},98,"#2",null,147,{"v":49,"d":"49.00"},null,297,{"v":30,"d":"30.00"},null,147,{"v":30,"d":"30.00"},109,{"v":15,"d":"15.00"}]
[{"$nulls":6},99,"#2",null,148,{"v":49,"d":"49.00"},null,298,{"v":30,"d":"30.00"},null,148,{"v":30,"d":"30.00"},110,{"v":15,"d":"15.00"}]
[{"$nulls":6},100,"#3",null,149,{"v":49,"d":"49.00"},null,299,{"v":30,"d":"30.00"},null,149,{"v":30,"d":"30.00"},111,{"v":15,"d":"15.00"}]
[{"$nulls":6},101,"#3",null,150,{"v":49,"d":"49.00"},null,300,{"v":30,"d":"30.00"},null,150,{"v":30,"d":"30.00"},112,{"v":15,"d":"15.00"}]
[{"$nulls":6},102,"#3",null,151,{"v":49,"d":"49.00"},null,301,{"v":30,"d":"30.00"},null,151,{"v":30,"d":"30.00"},113,{"v":15,"d":"15.00"}]
[{"$nulls":6},103,"#3",null,152,{"v":49,"d":"49.00"},null,302,{"v":30,"d":"30.00"},null,152,{"v":30,"d":"30.00"},114,{"v":15,"d":"15.00"}]
[{"$nulls":6},104,"#3",null,153,{"v":49,"d":"49.00"},null,303,{"v":30,"d":"30.00"},null,153,{"v":30,"d":"30.00"},115,{"v":15,"d":"15.00"}]
[{"$nulls":6},105,"#3",null,154,{"v":49,"d":"49.00"},null,304,{"v":30,"d":"30.00"},null,154,{"v":30,"d":"30.00"},116,{"v":15,"d":"15.00"}]
[{"$nulls":6},106,"#3",null,155,{"v":49,"d":"49.00"},null,305,{"v":30,"d":"30.00"},null,155,{"v":30,"d":"30.00"},117,{"v":15,"d":"15.00"}]
[{"$nulls":6},107,"#3",null,156,{"v":49,"d":"49.00"},null,306,{"v":30,"d":"30.00"},null,156,{"v":30,"d":"30.00"},118,{"v":15,"d":"15.00"}]
[{"$nulls":6},108,"#3",null,157,{"v":49,"d":"49.00"},null,307,{"v":30,"d":"30.00"},null,157,{"v":30,"d":"30.00"},119,{"v":15,"d":"15.00"}]
[{"$nulls":6},109,"#3",null,158,{"v":49,"d":"49.00"},null,308,{"v":30,"d":"30.00"},null,158,{"v":30,"d":"30.00"},120,{"v":15,"d":"15.00"}]
[{"$nulls":6},110,"#3",null,159,{"v":49,"d":"49.00"},null,309,{"v":30,"d":"30.00"},null,159,{"v":30,"d":"30.00"},121,{"v":15,"d":"15.00"}]
[{"$nulls":6},111,"#3",null,160,{"v":49,"d":"49.00"},null,310,{"v":30,"d":"30.00"},null,160,{"v":30,"d":"30.00"},122,{"v":15,"d":"15.00"}]
[{"$nulls":6},112,"#3",null,161,{"v":49,"d":"49.00"},null,311,{"v":30,"d":"30.00"},null,161,{"v":30,"d":"30.00"},123,{"v":15,"d":"15.00"}]
[{"$nulls":6},113,"#3",null,162,{"v":49,"d":"49.00"},null,312,{"v":30,"d":"30.00"},null,162,{"v":30,"d":"30.00"},124,{"v":15,"d":"15.00"}]
[{"$nulls":6},114,"#3",null,163,{"v":49,"d":"49.00"},null,313,{"v":30,"d":"30.00"},null,163,{"v":30,"d":"30.00"},125,{"v":15,"d":"15.00"}]
[{"$nulls":6},115,"#3",null,164,{"v":49,"d":"49.00"},null,314,{"v":30,"d":"30.00"},null,164,{"v":30,"d":"30.00"},126,{"v":15,"d":"15.00"}]
[{"$nulls":6},116,"#3",null,{"$f":"+J122+1","v":165},{"v":49,"d":"49.00"},null,315,{"v":30,"d":"30.00"},null,{"$f":"+P122+1","v":165},{"v":30,"d":"30.00"},127,{"v":15,"d":"15.00"}]
[{"$nulls":6},117,"#3",null,166,{"v":49,"d":"49.00"},null,316,{"v":30,"d":"30.00"},null,166,{"v":30,"d":"30.00"},128,{"v":15,"d":"15.00"}]
[{"$nulls":6},118,"#3",null,167,{"v":49,"d":"49.00"},null,317,{"v":30,"d":"30.00"},null,167,{"v":30,"d":"30.00"},129,{"v":15,"d":"15.00"}]
[{"$nulls":6},119,"#3",null,168,{"v":49,"d":"49.00"},null,318,{"v":30,"d":"30.00"},null,168,{"v":30,"d":"30.00"},130,{"v":15,"d":"15.00"}]
[{"$nulls":6},120,"#3",null,169,{"v":49,"d":"49.00"},null,319,{"v":30,"d":"30.00"},null,169,{"v":30,"d":"30.00"},131,{"v":15,"d":"15.00"}]
[{"$nulls":6},121,"#3",null,170,{"v":49,"d":"49.00"},null,320,{"v":30,"d":"30.00"},null,170,{"v":30,"d":"30.00"},132,{"v":15,"d":"15.00"}]
[{"$nulls":6},122,"#3",null,171,{"v":49,"d":"49.00"},null,321,{"v":30,"d":"30.00"},null,171,{"v":30,"d":"30.00"},133,{"v":15,"d":"15.00"}]
[{"$nulls":6},123,"#3",null,172,{"v":49,"d":"49.00"},null,322,{"v":30,"d":"30.00"},null,172,{"v":30,"d":"30.00"},134,{"v":15,"d":"15.00"}]
[{"$nulls":6},124,"#3",null,173,{"v":49,"d":"49.00"},null,323,{"v":30,"d":"30.00"},null,173,{"v":30,"d":"30.00"},135,{"v":15,"d":"15.00"}]
[{"$nulls":6},125,"#3",null,174,{"v":49,"d":"49.00"},null,324,{"v":30,"d":"30.00"},null,174,{"v":30,"d":"30.00"},136,{"v":15,"d":"15.00"}]
[{"$nulls":6},126,"#3",null,175,{"v":49,"d":"49.00"},null,325,{"v":30,"d":"30.00"},null,175,{"v":30,"d":"30.00"},137,{"v":15,"d":"15.00"}]
[{"$nulls":6},127,"#3",null,176,{"v":49,"d":"49.00"},null,326,{"v":30,"d":"30.00"},null,176,{"v":30,"d":"30.00"},138,{"v":15,"d":"15.00"}]
[{"$nulls":6},128,"#3",null,177,{"v":49,"d":"49.00"},null,327,{"v":30,"d":"30.00"},null,177,{"v":30,"d":"30.00"},139,{"v":15,"d":"15.00"}]
[{"$nulls":6},129,"#3",null,178,{"v":49,"d":"49.00"},null,328,{"v":30,"d":"30.00"},null,178,{"v":30,"d":"30.00"},140,{"v":15,"d":"15.00"}]
[{"$nulls":6},130,"#3",null,179,{"v":49,"d":"49.00"},null,329,{"v":30,"d":"30.00"},null,179,{"v":30,"d":"30.00"},141,{"v":15,"d":"15.00"}]
[{"$nulls":6},{"$f":"+G137+1","v":131},"#3",null,180,{"v":49,"d":"49.00"},null,330,{"v":30,"d":"30.00"},null,180,{"v":30,"d":"30.00"},142,{"v":15,"d":"15.00"}]
[{"$nulls":6},132,"#3",null,181,{"v":49,"d":"49.00"},null,331,{"v":30,"d":"30.00"},null,181,{"v":30,"d":"30.00"},143,{"v":15,"d":"15.00"}]
[{"$nulls":6},133,"#3",null,182,{"v":49,"d":"49.00"},null,332,{"v":30,"d":"30.00"},null,182,{"v":30,"d":"30.00"},144,{"v":15,"d":"15.00"}]
[{"$nulls":6},134,"#3",null,183,{"v":49,"d":"49.00"},null,333,{"v":30,"d":"30.00"},null,183,{"v":30,"d":"30.00"},145,{"v":15,"d":"15.00"}]
[{"$nulls":6},135,"#3",null,184,{"v":49,"d":"49.00"},null,334,{"v":30,"d":"30.00"},null,184,{"v":30,"d":"30.00"},146,{"v":15,"d":"15.00"}]
[{"$nulls":6},136,"#3",null,185,{"v":49,"d":"49.00"},null,335,{"v":30,"d":"30.00"},null,185,{"v":30,"d":"30.00"},147,{"v":15,"d":"15.00"}]
[{"$nulls":6},137,"#3",null,186,{"v":49,"d":"49.00"},null,336,{"v":30,"d":"30.00"},null,186,{"v":30,"d":"30.00"},148,{"v":15,"d":"15.00"}]
[{"$nulls":6},138,"#3",null,187,{"v":49,"d":"49.00"},null,337,{"v":30,"d":"30.00"},null,187,{"v":30,"d":"30.00"},149,{"v":15,"d":"15.00"}]
[{"$nulls":6},139,"#3",null,188,{"v":49,"d":"49.00"},null,338,{"v":30,"d":"30.00"},null,188,{"v":30,"d":"30.00"},150,{"v":15,"d":"15.00"}]
[{"$nulls":6},140,"#3",null,189,{"v":49,"d":"49.00"},null,339,{"v":30,"d":"30.00"},null,189,{"v":30,"d":"30.00"},151,{"v":15,"d":"15.00"}]
[{"$nulls":6},141,"#3",null,190,{"v":49,"d":"49.00"},null,340,{"v":30,"d":"30.00"},null,190,{"v":30,"d":"30.00"},152,{"v":15,"d":"15.00"}]
[{"$nulls":6},142,"#3",null,191,{"v":49,"d":"49.00"},null,341,{"v":30,"d":"30.00"},null,191,{"v":30,"d":"30.00"},153,{"v":15,"d":"15.00"}]
[{"$nulls":6},143,"#3",null,192,{"v":49,"d":"49.00"},null,342,{"v":30,"d":"30.00"},null,192,{"v":30,"d":"30.00"},154,{"v":15,"d":"15.00"}]
[{"$nulls":6},144,"#3",null,193,{"v":49,"d":"49.00"},null,343,{"v":30,"d":"30.00"},null,193,{"v":30,"d":"30.00"},155,{"v":15,"d":"15.00"}]
[{"$nulls":6},145,"#3",null,194,{"v":49,"d":"49.00"},null,344,{"v":30,"d":"30.00"},null,194,{"v":30,"d":"30.00"},156,{"v":15,"d":"15.00"}]
[{"$nulls":6},146,"#3",null,195,{"v":49,"d":"49.00"},null,345,{"v":30,"d":"30.00"},null,195,{"v":30,"d":"30.00"},157,{"v":15,"d":"15.00"}]
[{"$nulls":6},147,"#3",null,196,{"v":49,"d":"49.00"},null,346,{"v":30,"d":"30.00"},null,196,{"v":30,"d":"30.00"},158,{"v":15,"d":"15.00"}]
[{"$nulls":6},148,"#3",null,197,{"v":49,"d":"49.00"},null,347,{"v":30,"d":"30.00"},null,197,{"v":30,"d":"30.00"},159,{"v":15,"d":"15.00"}]
[{"$nulls":6},149,"#3",null,198,{"v":49,"d":"49.00"},null,348,{"v":30,"d":"30.00"},null,198,{"v":30,"d":"30.00"},160,{"v":15,"d":"15.00"}]
[{"$nulls":6},150,"#3",null,199,{"v":49,"d":"49.00"},null,349,{"v":30,"d":"30.00"},null,199,{"v":30,"d":"30.00"},161,{"v":15,"d":"15.00"}]
[{"$nulls":6},151,"#3",null,200,{"v":45,"d":"45.00"},null,350,{"v":29,"d":"29.00"},null,200,{"v":28,"d":"28.00"},162,{"v":15,"d":"15.00"}]
[{"$nulls":6},152,"#3",null,201,{"v":45,"d":"45.00"},null,351,{"v":29,"d":"29.00"},null,201,{"v":28,"d":"28.00"},163,{"v":15,"d":"15.00"}]
[{"$nulls":6},153,"#3",null,202,{"v":45,"d":"45.00"},null,352,{"v":29,"d":"29.00"},null,202,{"v":28,"d":"28.00"},164,{"v":15,"d":"15.00"}]
[{"$nulls":6},154,"#3",null,203,{"v":45,"d":"45.00"},null,353,{"v":29,"d":"29.00"},null,203,{"v":28,"d":"28.00"},165,{"v":15,"d":"15.00"}]
[{"$nulls":6},155,"#3",null,204,{"v":45,"d":"45.00"},null,354,{"v":29,"d":"29.00"},null,204,{"v":28,"d":"28.00"},166,{"v":15,"d":"15.00"}]
[{"$nulls":6},156,"#3",null,205,{"v":45,"d":"45.00"},null,355,{"v":29,"d":"29.00"},null,205,{"v":28,"d":"28.00"},167,{"v":15,"d":"15.00"}]
[{"$nulls":6},157,"#3",null,206,{"v":45,"d":"45.00"},null,356,{"v":29,"d":"29.00"},null,206,{"v":28,"d":"28.00"},168,{"v":15,"d":"15.00"}]
[{"$nulls":6},158,"#3",null,207,{"v":45,"d":"45.00"},null,357,{"v":29,"d":"29.00"},null,207,{"v":28,"d":"28.00"},169,{"v":15,"d":"15.00"}]
[{"$nulls":6},159,"#3",null,208,{"v":45,"d":"45.00"},null,358,{"v":29,"d":"29.00"},null,208,{"v":28,"d":"28.00"},170,{"v":15,"d":"15.00"}]
[{"$nulls":6},160,"#3",null,209,{"v":45,"d":"45.00"},null,359,{"v":29,"d":"29.00"},null,209,{"v":28,"d":"28.00"},171,{"v":15,"d":"15.00"}]
[{"$nulls":6},161,"#3",null,210,{"v":45,"d":"45.00"},null,360,{"v":29,"d":"29.00"},null,210,{"v":28,"d":"28.00"},172,{"v":15,"d":"15.00"}]
[{"$nulls":6},162,"#3",null,211,{"v":45,"d":"45.00"},null,361,{"v":29,"d":"29.00"},null,211,{"v":28,"d":"28.00"},173,{"v":15,"d":"15.00"}]
[{"$nulls":6},163,"#3",null,212,{"v":45,"d":"45.00"},null,362,{"v":29,"d":"29.00"},null,212,{"v":28,"d":"28.00"},174,{"v":15,"d":"15.00"}]
[{"$nulls":6},164,"#3",null,213,{"v":45,"d":"45.00"},null,363,{"v":29,"d":"29.00"},null,213,{"v":28,"d":"28.00"},175,{"v":15,"d":"15.00"}]
[{"$nulls":6},165,"#3",null,214,{"v":45,"d":"45.00"},null,364,{"v":29,"d":"29.00"},null,214,{"v":28,"d":"28.00"},176,{"v":15,"d":"15.00"}]
[{"$nulls":6},166,"#3",null,215,{"v":45,"d":"45.00"},null,365,{"v":29,"d":"29.00"},null,215,{"v":28,"d":"28.00"},177,{"v":15,"d":"15.00"}]
[{"$nulls":6},167,"#3",null,216,{"v":45,"d":"45.00"},null,366,{"v":29,"d":"29.00"},null,216,{"v":28,"d":"28.00"},178,{"v":15,"d":"15.00"}]
[{"$nulls":6},168,"#3",null,217,{"v":45,"d":"45.00"},null,367,{"v":29,"d":"29.00"},null,217,{"v":28,"d":"28.00"},179,{"v":15,"d":"15.00"}]
[{"$nulls":6},169,"#3",null,218,{"v":45,"d":"45.00"},null,368,{"v":29,"d":"29.00"},null,218,{"v":28,"d":"28.00"},180,{"v":15,"d":"15.00"}]
[{"$nulls":6},170,"#3",null,219,{"v":45,"d":"45.00"},null,369,{"v":29,"d":"29.00"},null,219,{"v":28,"d":"28.00"},181,{"v":15,"d":"15.00"}]
[{"$nulls":6},171,"#3",null,220,{"v":45,"d":"45.00"},null,370,{"v":29,"d":"29.00"},null,220,{"v":28,"d":"28.00"},182,{"v":15,"d":"15.00"}]
[{"$nulls":6},172,"#3",null,221,{"v":45,"d":"45.00"},null,371,{"v":29,"d":"29.00"},null,221,{"v":28,"d":"28.00"},183,{"v":15,"d":"15.00"}]
[{"$nulls":6},173,"#3",null,222,{"v":45,"d":"45.00"},null,372,{"v":29,"d":"29.00"},null,222,{"v":28,"d":"28.00"},184,{"v":15,"d":"15.00"}]
[{"$nulls":6},174,"#3",null,223,{"v":45,"d":"45.00"},null,373,{"v":29,"d":"29.00"},null,223,{"v":28,"d":"28.00"},185,{"v":15,"d":"15.00"}]
[{"$nulls":6},175,"#3",null,224,{"v":45,"d":"45.00"},null,374,{"v":29,"d":"29.00"},null,224,{"v":28,"d":"28.00"},186,{"v":15,"d":"15.00"}]
[{"$nulls":6},176,"#3",null,225,{"v":45,"d":"45.00"},null,375,{"v":29,"d":"29.00"},null,225,{"v":28,"d":"28.00"},187,{"v":15,"d":"15.00"}]
[{"$nulls":6},177,"#3",null,226,{"v":45,"d":"45.00"},null,376,{"v":29,"d":"29.00"},null,226,{"v":28,"d":"28.00"},188,{"v":15,"d":"15.00"}]
[{"$nulls":6},178,"#3",null,227,{"v":45,"d":"45.00"},null,377,{"v":29,"d":"29.00"},null,227,{"v":28,"d":"28.00"},189,{"v":15,"d":"15.00"}]
[{"$nulls":6},179,"#3",null,228,{"v":45,"d":"45.00"},null,378,{"v":29,"d":"29.00"},null,228,{"v":28,"d":"28.00"}]
[{"$nulls":6},180,"#3",null,{"$f":"+J186+1","v":229},{"v":45,"d":"45.00"},null,379,{"v":29,"d":"29.00"},null,{"$f":"+P186+1","v":229},{"v":28,"d":"28.00"}]
[{"$nulls":6},181,"#3",null,230,{"v":45,"d":"45.00"},null,380,{"v":29,"d":"29.00"},null,230,{"v":28,"d":"28.00"}]
[{"$nulls":6},182,"#3",null,231,{"v":45,"d":"45.00"},null,381,{"v":29,"d":"29.00"},null,231,{"v":28,"d":"28.00"}]
[{"$nulls":6},183,"#3",null,232,{"v":45,"d":"45.00"},null,382,{"v":29,"d":"29.00"},null,232,{"v":28,"d":"28.00"}]
[{"$nulls":6},184,"#3",null,233,{"v":45,"d":"45.00"},null,383,{"v":29,"d":"29.00"},null,233,{"v":28,"d":"28.00"}]
[{"$nulls":6},185,"#3",null,234,{"v":45,"d":"45.00"},null,384,{"v":29,"d":"29.00"},null,234,{"v":28,"d":"28.00"}]
[{"$nulls":6},186,"#3",null,235,{"v":45,"d":"45.00"},null,385,{"v":29,"d":"29.00"},null,235,{"v":28,"d":"28.00"}]
[{"$nulls":6},187,"#3",null,236,{"v":45,"d":"45.00"},null,386,{"v":29,"d":"29.00"},null,236,{"v":28,"d":"28.00"}]
[{"$nulls":6},188,"#3",null,237,{"v":45,"d":"45.00"},null,387,{"v":29,"d":"29.00"},null,237,{"v":28,"d":"28.00"}]
[{"$nulls":6},189,"#3",null,238,{"v":45,"d":"45.00"},null,388,{"v":29,"d":"29.00"},null,238,{"v":28,"d":"28.00"}]
[{"$nulls":6},190,"#3",null,239,{"v":45,"d":"45.00"},null,389,{"v":29,"d":"29.00"},null,239,{"v":28,"d":"28.00"}]
[{"$nulls":6},191,"#3",null,240,{"v":45,"d":"45.00"},null,390,{"v":29,"d":"29.00"},null,240,{"v":28,"d":"28.00"}]
[{"$nulls":6},192,"#3",null,241,{"v":45,"d":"45.00"},null,391,{"v":29,"d":"29.00"},null,241,{"v":28,"d":"28.00"}]
[{"$nulls":6},193,"#3",null,242,{"v":45,"d":"45.00"},null,392,{"v":29,"d":"29.00"},null,242,{"v":28,"d":"28.00"}]
[{"$nulls":6},194,"#3",null,243,{"v":45,"d":"45.00"},null,393,{"v":29,"d":"29.00"},null,243,{"v":28,"d":"28.00"}]
[{"$nulls":6},{"$f":"+G201+1","v":195},"#3",null,244,{"v":45,"d":"45.00"},null,394,{"v":29,"d":"29.00"},null,244,{"v":28,"d":"28.00"}]
[{"$nulls":6},196,"#3",null,245,{"v":45,"d":"45.00"},null,395,{"v":29,"d":"29.00"},null,245,{"v":28,"d":"28.00"}]
[{"$nulls":6},197,"#3",null,246,{"v":45,"d":"45.00"},null,396,{"v":29,"d":"29.00"},null,246,{"v":28,"d":"28.00"}]
[{"$nulls":6},198,"#3",null,247,{"v":45,"d":"45.00"},null,397,{"v":29,"d":"29.00"},null,247,{"v":28,"d":"28.00"}]
[{"$nulls":6},199,"#3",null,248,{"v":45,"d":"45.00"},null,398,{"v":29,"d":"29.00"},null,248,{"v":28,"d":"28.00"}]
[{"$nulls":6},200,"#4",null,249,{"v":45,"d":"45.00"},null,399,{"v":29,"d":"29.00"},null,249,{"v":28,"d":"28.00"}]
[{"$nulls":6},201,"#4",null,250,{"v":40,"d":"40.00"},null,400,{"v":29,"d":"29.00"},null,250,{"v":28,"d":"28.00"}]
[{"$nulls":6},202,"#4",null,251,{"v":40,"d":"40.00"},null,401,{"v":29,"d":"29.00"},null,251,{"v":28,"d":"28.00"}]
[{"$nulls":6},203,"#4",null,252,{"v":40,"d":"40.00"},null,402,{"v":29,"d":"29.00"},null,252,{"v":28,"d":"28.00"}]
[{"$nulls":6},204,"#4",null,253,{"v":40,"d":"40.00"},null,403,{"v":29,"d":"29.00"},null,253,{"v":28,"d":"28.00"}]
[{"$nulls":6},205,"#4",null,254,{"v":40,"d":"40.00"},null,404,{"v":29,"d":"29.00"},null,254,{"v":28,"d":"28.00"}]
[{"$nulls":6},206,"#4",null,255,{"v":40,"d":"40.00"},null,405,{"v":29,"d":"29.00"},null,255,{"v":28,"d":"28.00"}]
[{"$nulls":6},207,"#4",null,256,{"v":40,"d":"40.00"},null,406,{"v":29,"d":"29.00"},null,256,{"v":28,"d":"28.00"}]
[{"$nulls":6},208,"#4",null,257,{"v":40,"d":"40.00"},null,407,{"v":29,"d":"29.00"},null,257,{"v":28,"d":"28.00"}]
[{"$nulls":6},209,"#4",null,258,{"v":40,"d":"40.00"},null,408,{"v":29,"d":"29.00"},null,258,{"v":28,"d":"28.00"}]
[{"$nulls":6},210,"#4",null,259,{"v":40,"d":"40.00"},null,409,{"v":29,"d":"29.00"},null,259,{"v":28,"d":"28.00"}]
[{"$nulls":6},211,"#4",null,260,{"v":40,"d":"40.00"},null,410,{"v":29,"d":"29.00"},null,260,{"v":28,"d":"28.00"}]
[{"$nulls":6},212,"#4",null,261,{"v":40,"d":"40.00"},null,411,{"v":29,"d":"29.00"},null,261,{"v":28,"d":"28.00"}]
[{"$nulls":6},213,"#4",null,262,{"v":40,"d":"40.00"},null,412,{"v":29,"d":"29.00"},null,262,{"v":28,"d":"28.00"}]
[{"$nulls":6},214,"#4",null,263,{"v":40,"d":"40.00"},null,413,{"v":29,"d":"29.00"},null,263,{"v":28,"d":"28.00"}]
[{"$nulls":6},215,"#4",null,264,{"v":40,"d":"40.00"},null,414,{"v":29,"d":"29.00"},null,264,{"v":28,"d":"28.00"}]
[{"$nulls":6},216,"#4",null,265,{"v":40,"d":"40.00"},null,415,{"v":29,"d":"29.00"},null,265,{"v":28,"d":"28.00"}]
[{"$nulls":6},217,"#4",null,266,{"v":40,"d":"40.00"},null,416,{"v":29,"d":"29.00"},null,266,{"v":28,"d":"28.00"}]
[{"$nulls":6},218,"#4",null,267,{"v":40,"d":"40.00"},null,417,{"v":29,"d":"29.00"},null,267,{"v":28,"d":"28.00"}]
[{"$nulls":6},219,"#4",null,268,{"v":40,"d":"40.00"},null,418,{"v":29,"d":"29.00"},null,268,{"v":28,"d":"28.00"}]
[{"$nulls":6},220,"#4",null,269,{"v":40,"d":"40.00"},null,419,{"v":29,"d":"29.00"},null,269,{"v":28,"d":"28.00"}]
[{"$nulls":6},221,"#4",null,270,{"v":40,"d":"40.00"},null,420,{"v":29,"d":"29.00"},null,270,{"v":28,"d":"28.00"}]
[{"$nulls":6},222,"#4",null,271,{"v":40,"d":"40.00"},null,421,{"v":29,"d":"29.00"},null,271,{"v":28,"d":"28.00"}]
[{"$nulls":6},223,"#4",null,272,{"v":40,"d":"40.00"},null,422,{"v":29,"d":"29.00"},null,272,{"v":28,"d":"28.00"}]
[{"$nulls":6},224,"#4",null,273,{"v":40,"d":"40.00"},null,423,{"v":29,"d":"29.00"},null,273,{"v":28,"d":"28.00"}]
[{"$nulls":6},225,"#4",null,274,{"v":40,"d":"40.00"},null,424,{"v":29,"d":"29.00"},null,274,{"v":28,"d":"28.00"}]
[{"$nulls":6},226,"#4",null,275,{"v":40,"d":"40.00"},null,425,{"v":29,"d":"29.00"},null,275,{"v":28,"d":"28.00"}]
[{"$nulls":6},227,"#4",null,276,{"v":40,"d":"40.00"},null,426,{"v":29,"d":"29.00"},null,276,{"v":28,"d":"28.00"}]
[{"$nulls":6},228,"#4",null,277,{"v":40,"d":"40.00"},null,427,{"v":29,"d":"29.00"},null,277,{"v":28,"d":"28.00"}]
[{"$nulls":6},229,"#4",null,278,{"v":40,"d":"40.00"},null,428,{"v":29,"d":"29.00"},null,278,{"v":28,"d":"28.00"}]
[{"$nulls":6},230,"#4",null,279,{"v":40,"d":"40.00"},null,429,{"v":29,"d":"29.00"},null,279,{"v":28,"d":"28.00"}]
[{"$nulls":6},231,"#4",null,280,{"v":40,"d":"40.00"},null,430,{"v":29,"d":"29.00"},null,280,{"v":28,"d":"28.00"}]
[{"$nulls":6},232,"#4",null,281,{"v":40,"d":"40.00"},null,431,{"v":29,"d":"29.00"},null,281,{"v":28,"d":"28.00"}]
[{"$nulls":6},233,"#4",null,282,{"v":40,"d":"40.00"},null,432,{"v":29,"d":"29.00"},null,282,{"v":28,"d":"28.00"}]
[{"$nulls":6},234,"#4",null,283,{"v":40,"d":"40.00"},null,433,{"v":29,"d":"29.00"},null,283,{"v":28,"d":"28.00"}]
[{"$nulls":6},235,"#4",null,284,{"v":40,"d":"40.00"},null,434,{"v":29,"d":"29.00"},null,284,{"v":28,"d":"28.00"}]
[{"$nulls":6},236,"#4",null,285,{"v":40,"d":"40.00"},null,435,{"v":29,"d":"29.00"},null,285,{"v":28,"d":"28.00"}]
[{"$nulls":6},237,"#4",null,286,{"v":40,"d":"40.00"},null,436,{"v":29,"d":"29.00"},null,286,{"v":28,"d":"28.00"}]
[{"$nulls":6},238,"#4",null,287,{"v":40,"d":"40.00"},null,437,{"v":29,"d":"29.00"},null,287,{"v":28,"d":"28.00"}]
[{"$nulls":6},239,"#4",null,288,{"v":40,"d":"40.00"},null,438,{"v":29,"d":"29.00"},null,288,{"v":28,"d":"28.00"}]
[{"$nulls":6},240,"#4",null,289,{"v":40,"d":"40.00"},null,439,{"v":29,"d":"29.00"},null,289,{"v":28,"d":"28.00"}]
[{"$nulls":6},241,"#4",null,290,{"v":40,"d":"40.00"},null,440,{"v":29,"d":"29.00"},null,290,{"v":28,"d":"28.00"}]
[{"$nulls":6},242,"#4",null,291,{"v":40,"d":"40.00"},null,441,{"v":29,"d":"29.00"},null,291,{"v":28,"d":"28.00"}]
[{"$nulls":6},243,"#4",null,292,{"v":40,"d":"40.00"},null,442,{"v":29,"d":"29.00"},null,292,{"v":28,"d":"28.00"}]
[{"$nulls":6},244,"#4",null,{"$f":"+J250+1","v":293},{"v":40,"d":"40.00"},null,443,{"v":29,"d":"29.00"},null,{"$f":"+P250+1","v":293},{"v":28,"d":"28.00"}]
[{"$nulls":6},245,"#4",null,294,{"v":40,"d":"40.00"},null,444,{"v":29,"d":"29.00"},null,294,{"v":28,"d":"28.00"}]
[{"$nulls":6},246,"#4",null,295,{"v":40,"d":"40.00"},null,445,{"v":29,"d":"29.00"},null,295,{"v":28,"d":"28.00"}]
[{"$nulls":6},247,"#4",null,296,{"v":40,"d":"40.00"},null,446,{"v":29,"d":"29.00"},null,296,{"v":28,"d":"28.00"}]
[{"$nulls":6},248,"#4",null,297,{"v":40,"d":"40.00"},null,447,{"v":29,"d":"29.00"},null,297,{"v":28,"d":"28.00"}]
[{"$nulls":6},249,"#4",null,298,{"v":40,"d":"40.00"},null,448,{"v":29,"d":"29.00"},null,298,{"v":28,"d":"28.00"}]
[{"$nulls":6},250,"#5",null,299,{"v":40,"d":"40.00"},null,449,{"v":29,"d":"29.00"},null,299,{"v":28,"d":"28.00"}]
[{"$nulls":6},251,"#5",null,300,{"v":40,"d":"40.00"},null,450,{"v":29,"d":"29.00"},null,300,{"v":26,"d":"26.00"}]
[{"$nulls":6},252,"#5",null,301,{"v":40,"d":"40.00"},null,451,{"v":29,"d":"29.00"},null,301,{"v":26,"d":"26.00"}]
[{"$nulls":6},253,"#5",null,302,{"v":40,"d":"40.00"},null,452,{"v":29,"d":"29.00"},null,302,{"v":26,"d":"26.00"}]
[{"$nulls":6},254,"#5",null,303,{"v":40,"d":"40.00"},null,453,{"v":29,"d":"29.00"},null,303,{"v":26,"d":"26.00"}]
[{"$nulls":6},255,"#5",null,304,{"v":40,"d":"40.00"},null,454,{"v":29,"d":"29.00"},null,304,{"v":26,"d":"26.00"}]
[{"$nulls":6},256,"#5",null,305,{"v":40,"d":"40.00"},null,455,{"v":29,"d":"29.00"},null,305,{"v":26,"d":"26.00"}]
[{"$nulls":6},257,"#5",null,306,{"v":40,"d":"40.00"},null,456,{"v":29,"d":"29.00"},null,306,{"v":26,"d":"26.00"}]
[{"$nulls":6},258,"#5",null,307,{"v":40,"d":"40.00"},null,457,{"v":29,"d":"29.00"},null,307,{"v":26,"d":"26.00"}]
[{"$nulls":6},{"$f":"+G265+1","v":259},"#5",null,308,{"v":40,"d":"40.00"},null,458,{"v":29,"d":"29.00"},null,308,{"v":26,"d":"26.00"}]
[{"$nulls":6},260,"#5",null,309,{"v":40,"d":"40.00"},null,459,{"v":29,"d":"29.00"},null,309,{"v":26,"d":"26.00"}]
[{"$nulls":6},261,"#5",null,310,{"v":40,"d":"40.00"},null,460,{"v":29,"d":"29.00"},null,310,{"v":26,"d":"26.00"}]
[{"$nulls":6},262,"#5",null,311,{"v":40,"d":"40.00"},null,461,{"v":29,"d":"29.00"},null,311,{"v":26,"d":"26.00"}]
[{"$nulls":6},263,"#5",null,312,{"v":40,"d":"40.00"},null,462,{"v":29,"d":"29.00"},null,312,{"v":26,"d":"26.00"}]
[{"$nulls":6},264,"#5",null,313,{"v":40,"d":"40.00"},null,463,{"v":29,"d":"29.00"},null,313,{"v":26,"d":"26.00"}]
[{"$nulls":6},265,"#5",null,314,{"v":40,"d":"40.00"},null,464,{"v":29,"d":"29.00"},null,314,{"v":26,"d":"26.00"}]
[{"$nulls":6},266,"#5",null,315,{"v":40,"d":"40.00"},null,465,{"v":29,"d":"29.00"},null,315,{"v":26,"d":"26.00"}]
[{"$nulls":6},267,"#5",null,316,{"v":40,"d":"40.00"},null,466,{"v":29,"d":"29.00"},null,316,{"v":26,"d":"26.00"}]
[{"$nulls":6},268,"#5",null,317,{"v":40,"d":"40.00"},null,467,{"v":29,"d":"29.00"},null,317,{"v":26,"d":"26.00"}]
[{"$nulls":6},269,"#5",null,318,{"v":40,"d":"40.00"},null,468,{"v":29,"d":"29.00"},null,318,{"v":26,"d":"26.00"}]
[{"$nulls":6},270,"#5",null,319,{"v":40,"d":"40.00"},null,469,{"v":29,"d":"29.00"},null,319,{"v":26,"d":"26.00"}]
[{"$nulls":6},271,"#5",null,320,{"v":40,"d":"40.00"},null,470,{"v":29,"d":"29.00"},null,320,{"v":26,"d":"26.00"}]
[{"$nulls":6},272,"#5",null,321,{"v":40,"d":"40.00"},null,471,{"v":29,"d":"29.00"},null,321,{"v":26,"d":"26.00"}]
[{"$nulls":6},273,"#5",null,322,{"v":40,"d":"40.00"},null,472,{"v":29,"d":"29.00"},null,322,{"v":26,"d":"26.00"}]
[{"$nulls":6},274,"#5",null,323,{"v":40,"d":"40.00"},null,473,{"v":29,"d":"29.00"},null,323,{"v":26,"d":"26.00"}]
[{"$nulls":6},275,"#5",null,324,{"v":40,"d":"40.00"},null,474,{"v":29,"d":"29.00"},null,324,{"v":26,"d":"26.00"}]
[{"$nulls":6},276,"#5",null,325,{"v":40,"d":"40.00"},null,475,{"v":29,"d":"29.00"},null,325,{"v":26,"d":"26.00"}]
[{"$nulls":6},277,"#5",null,326,{"v":40,"d":"40.00"},null,476,{"v":29,"d":"29.00"},null,326,{"v":26,"d":"26.00"}]
[{"$nulls":6},278,"#5",null,327,{"v":40,"d":"40.00"},null,477,{"v":29,"d":"29.00"},null,327,{"v":26,"d":"26.00"}]
[{"$nulls":6},279,"#5",null,328,{"v":40,"d":"40.00"},null,478,{"v":29,"d":"29.00"},null,328,{"v":26,"d":"26.00"}]
[{"$nulls":6},280,"#5",null,329,{"v":40,"d":"40.00"},null,479,{"v":29,"d":"29.00"},null,329,{"v":26,"d":"26.00"}]
[{"$nulls":6},281,"#5",null,330,{"v":40,"d":"40.00"},null,480,{"v":29,"d":"29.00"},null,330,{"v":26,"d":"26.00"}]
[{"$nulls":6},282,"#5",null,331,{"v":40,"d":"40.00"},null,481,{"v":29,"d":"29.00"},null,331,{"v":26,"d":"26.00"}]
[{"$nulls":6},283,"#5",null,332,{"v":40,"d":"40.00"},null,482,{"v":29,"d":"29.00"},null,332,{"v":26,"d":"26.00"}]
[{"$nulls":6},284,"#5",null,333,{"v":40,"d":"40.00"},null,483,{"v":29,"d":"29.00"},null,333,{"v":26,"d":"26.00"}]
[{"$nulls":6},285,"#5",null,334,{"v":40,"d":"40.00"},null,484,{"v":29,"d":"29.00"},null,334,{"v":26,"d":"26.00"}]
[{"$nulls":6},286,"#5",null,335,{"v":40,"d":"40.00"},null,485,{"v":29,"d":"29.00"},null,335,{"v":26,"d":"26.00"}]
[{"$nulls":6},287,"#5",null,336,{"v":40,"d":"40.00"},null,486,{"v":29,"d":"29.00"},null,336,{"v":26,"d":"26.00"}]
[{"$nulls":6},288,"#5",null,337,{"v":40,"d":"40.00"},null,487,{"v":29,"d":"29.00"},null,337,{"v":26,"d":"26.00"}]
[{"$nulls":6},289,"#5",null,338,{"v":40,"d":"40.00"},null,488,{"v":29,"d":"29.00"},null,338,{"v":26,"d":"26.00"}]
[{"$nulls":6},290,"#5",null,339,{"v":40,"d":"40.00"},null,489,{"v":29,"d":"29.00"},null,339,{"v":26,"d":"26.00"}]
[{"$nulls":6},291,"#5",null,340,{"v":40,"d":"40.00"},null,490,{"v":29,"d":"29.00"},null,340,{"v":26,"d":"26.00"}]
[{"$nulls":6},292,"#5",null,341,{"v":40,"d":"40.00"},null,491,{"v":29,"d":"29.00"},null,341,{"v":26,"d":"26.00"}]
[{"$nulls":6},293,"#5",null,342,{"v":40,"d":"40.00"},null,492,{"v":29,"d":"29.00"},null,342,{"v":26,"d":"26.00"}]
[{"$nulls":6},294,"#5",null,343,{"v":40,"d":"40.00"},null,493,{"v":29,"d":"29.00"},null,343,{"v":26,"d":"26.00"}]
[{"$nulls":6},295,"#5",null,344,{"v":40,"d":"40.00"},null,494,{"v":29,"d":"29.00"},null,344,{"v":26,"d":"26.00"}]
[{"$nulls":6},296,"#5",null,345,{"v":40,"d":"40.00"},null,495,{"v":29,"d":"29.00"},null,345,{"v":26,"d":"26.00"}]
[{"$nulls":6},297,"#5",null,346,{"v":40,"d":"40.00"},null,496,{"v":29,"d":"29.00"},null,346,{"v":26,"d":"26.00"}]
[{"$nulls":6},298,"#5",null,347,{"v":40,"d":"40.00"},null,497,{"v":29,"d":"29.00"},null,347,{"v":26,"d":"26.00"}]
[{"$nulls":6},299,"#5",null,348,{"v":40,"d":"40.00"},null,498,{"v":29,"d":"29.00"},null,348,{"v":26,"d":"26.00"}]
[{"$nulls":6},300,"#5",null,349,{"v":40,"d":"40.00"},null,499,{"v":29,"d":"29.00"},null,349,{"v":26,"d":"26.00"}]
[{"$nulls":6},301,"#5",null,350,{"v":38,"d":"38.00"},{"$nulls":4},350,{"v":26,"d":"26.00"}]
[{"$nulls":6},302,"#5",null,351,{"v":38,"d":"38.00"},{"$nulls":4},351,{"v":26,"d":"26.00"}]
[{"$nulls":6},303,"#5",null,352,{"v":38,"d":"38.00"},{"$nulls":4},352,{"v":26,"d":"26.00"}]
[{"$nulls":6},304,"#5",null,353,{"v":38,"d":"38.00"},{"$nulls":4},353,{"v":26,"d":"26.00"}]
[{"$nulls":6},305,"#5",null,354,{"v":38,"d":"38.00"},{"$nulls":4},354,{"v":26,"d":"26.00"}]
[{"$nulls":6},306,"#5",null,355,{"v":38,"d":"38.00"},{"$nulls":4},355,{"v":26,"d":"26.00"}]
[{"$nulls":6},307,"#5",null,356,{"v":38,"d":"38.00"},{"$nulls":4},356,{"v":26,"d":"26.00"}]
[{"$nulls":6},308,"#5",null,{"$f":"+J314+1","v":357},{"v":38,"d":"38.00"},{"$nulls":4},{"$f":"+P314+1","v":357},{"v":26,"d":"26.00"}]
[{"$nulls":6},309,"#5",null,358,{"v":38,"d":"38.00"},{"$nulls":4},358,{"v":26,"d":"26.00"}]
[{"$nulls":6},310,"#5",null,359,{"v":38,"d":"38.00"},{"$nulls":4},359,{"v":26,"d":"26.00"}]
[{"$nulls":6},311,"#5",null,360,{"v":38,"d":"38.00"},{"$nulls":4},360,{"v":26,"d":"26.00"}]
[{"$nulls":6},312,"#5",null,361,{"v":38,"d":"38.00"},{"$nulls":4},361,{"v":26,"d":"26.00"}]
[{"$nulls":6},313,"#5",null,362,{"v":38,"d":"38.00"},{"$nulls":4},362,{"v":26,"d":"26.00"}]
[{"$nulls":6},314,"#5",null,363,{"v":38,"d":"38.00"},{"$nulls":4},363,{"v":26,"d":"26.00"}]
[{"$nulls":6},315,"#5",null,364,{"v":38,"d":"38.00"},{"$nulls":4},364,{"v":26,"d":"26.00"}]
[{"$nulls":6},316,"#5",null,365,{"v":38,"d":"38.00"},{"$nulls":4},365,{"v":26,"d":"26.00"}]
[{"$nulls":6},317,"#5",null,366,{"v":38,"d":"38.00"},{"$nulls":4},366,{"v":26,"d":"26.00"}]
[{"$nulls":6},318,"#5",null,367,{"v":38,"d":"38.00"},{"$nulls":4},367,{"v":26,"d":"26.00"}]
[{"$nulls":6},319,"#5",null,368,{"v":38,"d":"38.00"},{"$nulls":4},368,{"v":26,"d":"26.00"}]
[{"$nulls":6},320,"#5",null,369,{"v":38,"d":"38.00"},{"$nulls":4},369,{"v":26,"d":"26.00"}]
[{"$nulls":6},321,"#5",null,370,{"v":38,"d":"38.00"},{"$nulls":4},370,{"v":26,"d":"26.00"}]
[{"$nulls":6},322,"#5",null,371,{"v":38,"d":"38.00"},{"$nulls":4},371,{"v":26,"d":"26.00"}]
[{"$nulls":6},{"$f":"+G329+1","v":323},"#5",null,372,{"v":38,"d":"38.00"},{"$nulls":4},372,{"v":26,"d":"26.00"}]
[{"$nulls":6},324,"#5",null,373,{"v":38,"d":"38.00"},{"$nulls":4},373,{"v":26,"d":"26.00"}]
[{"$nulls":6},325,"#5",null,374,{"v":38,"d":"38.00"},{"$nulls":4},374,{"v":26,"d":"26.00"}]
[{"$nulls":6},326,"#5",null,375,{"v":38,"d":"38.00"},{"$nulls":4},375,{"v":26,"d":"26.00"}]
[{"$nulls":6},327,"#5",null,376,{"v":38,"d":"38.00"},{"$nulls":4},376,{"v":26,"d":"26.00"}]
[{"$nulls":6},328,"#5",null,377,{"v":38,"d":"38.00"},{"$nulls":4},377,{"v":26,"d":"26.00"}]
[{"$nulls":6},329,"#5",null,378,{"v":38,"d":"38.00"},{"$nulls":4},378,{"v":26,"d":"26.00"}]
[{"$nulls":6},330,"#5",null,379,{"v":38,"d":"38.00"},{"$nulls":4},379,{"v":26,"d":"26.00"}]
[{"$nulls":6},331,"#5",null,380,{"v":38,"d":"38.00"},{"$nulls":4},380,{"v":26,"d":"26.00"}]
[{"$nulls":6},332,"#5",null,381,{"v":38,"d":"38.00"},{"$nulls":4},381,{"v":26,"d":"26.00"}]
[{"$nulls":6},333,"#5",null,382,{"v":38,"d":"38.00"},{"$nulls":4},382,{"v":26,"d":"26.00"}]
[{"$nulls":6},334,"#5",null,383,{"v":38,"d":"38.00"},{"$nulls":4},383,{"v":26,"d":"26.00"}]
[{"$nulls":6},335,"#5",null,384,{"v":38,"d":"38.00"},{"$nulls":4},384,{"v":26,"d":"26.00"}]
[{"$nulls":6},336,"#5",null,385,{"v":38,"d":"38.00"},{"$nulls":4},385,{"v":26,"d":"26.00"}]
[{"$nulls":6},337,"#5",null,386,{"v":38,"d":"38.00"},{"$nulls":4},386,{"v":26,"d":"26.00"}]
[{"$nulls":6},338,"#5",null,387,{"v":38,"d":"38.00"},{"$nulls":4},387,{"v":26,"d":"26.00"}]
[{"$nulls":6},339,"#5",null,388,{"v":38,"d":"38.00"},{"$nulls":4},388,{"v":26,"d":"26.00"}]
[{"$nulls":6},340,"#5",null,389,{"v":38,"d":"38.00"},{"$nulls":4},389,{"v":26,"d":"26.00"}]
[{"$nulls":6},341,"#5",null,390,{"v":38,"d":"38.00"},{"$nulls":4},390,{"v":26,"d":"26.00"}]
[{"$nulls":6},342,"#5",null,391,{"v":38,"d":"38.00"},{"$nulls":4},391,{"v":26,"d":"26.00"}]
[{"$nulls":6},343,"#5",null,392,{"v":38,"d":"38.00"},{"$nulls":4},392,{"v":26,"d":"26.00"}]
[{"$nulls":6},344,"#5",null,393,{"v":38,"d":"38.00"},{"$nulls":4},393,{"v":26,"d":"26.00"}]
[{"$nulls":6},345,"#5",null,394,{"v":38,"d":"38.00"},{"$nulls":4},394,{"v":26,"d":"26.00"}]
[{"$nulls":6},346,"#5",null,395,{"v":38,"d":"38.00"},{"$nulls":4},395,{"v":26,"d":"26.00"}]
[{"$nulls":6},347,"#5",null,396,{"v":38,"d":"38.00"},{"$nulls":4},396,{"v":26,"d":"26.00"}]
[{"$nulls":6},348,"#5",null,397,{"v":38,"d":"38.00"},{"$nulls":4},397,{"v":26,"d":"26.00"}]
[{"$nulls":6},349,"#5",null,398,{"v":38,"d":"38.00"},{"$nulls":4},398,{"v":26,"d":"26.00"}]
[{"$nulls":6},350,"#6",null,399,{"v":38,"d":"38.00"},{"$nulls":4},399,{"v":26,"d":"26.00"}]
[{"$nulls":6},351,"#6",null,400,{"v":38,"d":"38.00"},{"$nulls":4},400,{"v":24,"d":"24.00"}]
[{"$nulls":6},352,"#6",null,401,{"v":38,"d":"38.00"},{"$nulls":4},401,{"v":24,"d":"24.00"}]
[{"$nulls":6},353,"#6",null,402,{"v":38,"d":"38.00"},{"$nulls":4},402,{"v":24,"d":"24.00"}]
[{"$nulls":6},354,"#6",null,403,{"v":38,"d":"38.00"},{"$nulls":4},403,{"v":24,"d":"24.00"}]
[{"$nulls":6},355,"#6",null,404,{"v":38,"d":"38.00"},{"$nulls":4},404,{"v":24,"d":"24.00"}]
[{"$nulls":6},356,"#6",null,405,{"v":38,"d":"38.00"},{"$nulls":4},405,{"v":24,"d":"24.00"}]
[{"$nulls":6},357,"#6",null,406,{"v":38,"d":"38.00"},{"$nulls":4},406,{"v":24,"d":"24.00"}]
[{"$nulls":6},358,"#6",null,407,{"v":38,"d":"38.00"},{"$nulls":4},407,{"v":24,"d":"24.00"}]
[{"$nulls":6},359,"#6",null,408,{"v":38,"d":"38.00"},{"$nulls":4},408,{"v":24,"d":"24.00"}]
[{"$nulls":6},360,"#6",null,409,{"v":38,"d":"38.00"},{"$nulls":4},409,{"v":24,"d":"24.00"}]
[{"$nulls":6},361,"#6",null,410,{"v":38,"d":"38.00"},{"$nulls":4},410,{"v":24,"d":"24.00"}]
[{"$nulls":6},362,"#6",null,411,{"v":38,"d":"38.00"},{"$nulls":4},411,{"v":24,"d":"24.00"}]
[{"$nulls":6},363,"#6",null,412,{"v":38,"d":"38.00"},{"$nulls":4},412,{"v":24,"d":"24.00"}]
[{"$nulls":6},364,"#6",null,413,{"v":38,"d":"38.00"},{"$nulls":4},413,{"v":24,"d":"24.00"}]
[{"$nulls":6},365,"#6",null,414,{"v":38,"d":"38.00"},{"$nulls":4},414,{"v":24,"d":"24.00"}]
[{"$nulls":6},366,"#6",null,415,{"v":38,"d":"38.00"},{"$nulls":4},415,{"v":24,"d":"24.00"}]
[{"$nulls":6},367,"#6",null,416,{"v":38,"d":"38.00"},{"$nulls":4},416,{"v":24,"d":"24.00"}]
[{"$nulls":6},368,"#6",null,417,{"v":38,"d":"38.00"},{"$nulls":4},417,{"v":24,"d":"24.00"}]
[{"$nulls":6},369,"#6",null,418,{"v":38,"d":"38.00"},{"$nulls":4},418,{"v":24,"d":"24.00"}]
[{"$nulls":6},370,"#6",null,419,{"v":38,"d":"38.00"},{"$nulls":4},419,{"v":24,"d":"24.00"}]
[{"$nulls":6},371,"#6",null,420,{"v":38,"d":"38.00"},{"$nulls":4},420,{"v":24,"d":"24.00"}]
[{"$nulls":6},372,"#6",null,{"$f":"+J378+1","v":421},{"v":38,"d":"38.00"},{"$nulls":4},{"$f":"+P378+1","v":421},{"v":24,"d":"24.00"}]
[{"$nulls":6},373,"#6",null,422,{"v":38,"d":"38.00"},{"$nulls":4},422,{"v":24,"d":"24.00"}]
[{"$nulls":6},374,"#6",null,423,{"v":38,"d":"38.00"},{"$nulls":4},423,{"v":24,"d":"24.00"}]
[{"$nulls":6},375,"#6",null,424,{"v":38,"d":"38.00"},{"$nulls":4},424,{"v":24,"d":"24.00"}]
[{"$nulls":6},376,"#6",null,425,{"v":38,"d":"38.00"},{"$nulls":4},425,{"v":24,"d":"24.00"}]
[{"$nulls":6},377,"#6",null,426,{"v":38,"d":"38.00"},{"$nulls":4},426,{"v":24,"d":"24.00"}]
[{"$nulls":6},378,"#6",null,427,{"v":38,"d":"38.00"},{"$nulls":4},427,{"v":24,"d":"24.00"}]
[{"$nulls":6},379,"#6",null,428,{"v":38,"d":"38.00"},{"$nulls":4},428,{"v":24,"d":"24.00"}]
[{"$nulls":6},380,"#6",null,429,{"v":38,"d":"38.00"},{"$nulls":4},429,{"v":24,"d":"24.00"}]
[{"$nulls":6},381,"#6",null,430,{"v":38,"d":"38.00"},{"$nulls":4},430,{"v":24,"d":"24.00"}]
[{"$nulls":6},382,"#6",null,431,{"v":38,"d":"38.00"},{"$nulls":4},431,{"v":24,"d":"24.00"}]
[{"$nulls":6},383,"#6",null,432,{"v":38,"d":"38.00"},{"$nulls":4},432,{"v":24,"d":"24.00"}]
[{"$nulls":6},384,"#6",null,433,{"v":38,"d":"38.00"},{"$nulls":4},433,{"v":24,"d":"24.00"}]
[{"$nulls":6},385,"#6",null,434,{"v":38,"d":"38.00"},{"$nulls":4},434,{"v":24,"d":"24.00"}]
[{"$nulls":6},386,"#6",null,435,{"v":38,"d":"38.00"},{"$nulls":4},435,{"v":24,"d":"24.00"}]
[{"$nulls":6},{"$f":"+G393+1","v":387},"#6",null,436,{"v":38,"d":"38.00"},{"$nulls":4},436,{"v":24,"d":"24.00"}]
[{"$nulls":6},388,"#6",null,437,{"v":38,"d":"38.00"},{"$nulls":4},437,{"v":24,"d":"24.00"}]
[{"$nulls":6},389,"#6",null,438,{"v":38,"d":"38.00"},{"$nulls":4},438,{"v":24,"d":"24.00"}]
[{"$nulls":6},390,"#6",null,439,{"v":38,"d":"38.00"},{"$nulls":4},439,{"v":24,"d":"24.00"}]
[{"$nulls":6},391,"#6",null,440,{"v":38,"d":"38.00"},{"$nulls":4},440,{"v":24,"d":"24.00"}]
[{"$nulls":6},392,"#6",null,441,{"v":38,"d":"38.00"},{"$nulls":4},441,{"v":24,"d":"24.00"}]
[{"$nulls":6},393,"#6",null,442,{"v":38,"d":"38.00"},{"$nulls":4},442,{"v":24,"d":"24.00"}]
[{"$nulls":6},394,"#6",null,443,{"v":38,"d":"38.00"},{"$nulls":4},443,{"v":24,"d":"24.00"}]
[{"$nulls":6},395,"#6",null,444,{"v":38,"d":"38.00"},{"$nulls":4},444,{"v":24,"d":"24.00"}]
[{"$nulls":6},396,"#6",null,445,{"v":38,"d":"38.00"},{"$nulls":4},445,{"v":24,"d":"24.00"}]
[{"$nulls":6},397,"#6",null,446,{"v":38,"d":"38.00"},{"$nulls":4},446,{"v":24,"d":"24.00"}]
[{"$nulls":6},398,"#6",null,447,{"v":38,"d":"38.00"},{"$nulls":4},447,{"v":24,"d":"24.00"}]
[{"$nulls":6},399,"#6",null,448,{"v":38,"d":"38.00"},{"$nulls":4},448,{"v":24,"d":"24.00"}]
[{"$nulls":6},400,"#6",null,449,{"v":38,"d":"38.00"},{"$nulls":4},449,{"v":24,"d":"24.00"}]
[{"$nulls":6},401,"#6",null,450,{"v":38,"d":"38.00"},{"$nulls":4},450,{"v":24,"d":"24.00"}]
[{"$nulls":6},402,"#6",null,451,{"v":38,"d":"38.00"},{"$nulls":4},451,{"v":24,"d":"24.00"}]
[{"$nulls":6},403,"#6",null,452,{"v":38,"d":"38.00"},{"$nulls":4},452,{"v":24,"d":"24.00"}]
[{"$nulls":6},404,"#6",null,453,{"v":38,"d":"38.00"},{"$nulls":4},453,{"v":24,"d":"24.00"}]
[{"$nulls":6},405,"#6",null,454,{"v":38,"d":"38.00"},{"$nulls":4},454,{"v":24,"d":"24.00"}]
[{"$nulls":6},406,"#6",null,455,{"v":38,"d":"38.00"},{"$nulls":4},455,{"v":24,"d":"24.00"}]
[{"$nulls":6},407,"#6",null,456,{"v":38,"d":"38.00"},{"$nulls":4},456,{"v":24,"d":"24.00"}]
[{"$nulls":6},408,"#6",null,457,{"v":38,"d":"38.00"},{"$nulls":4},457,{"v":24,"d":"24.00"}]
[{"$nulls":6},409,"#6",null,458,{"v":38,"d":"38.00"},{"$nulls":4},458,{"v":24,"d":"24.00"}]
[{"$nulls":6},410,"#6",null,459,{"v":38,"d":"38.00"},{"$nulls":4},459,{"v":24,"d":"24.00"}]
[{"$nulls":6},411,"#6",null,460,{"v":38,"d":"38.00"},{"$nulls":4},460,{"v":24,"d":"24.00"}]
[{"$nulls":6},412,"#6",null,461,{"v":38,"d":"38.00"},{"$nulls":4},461,{"v":24,"d":"24.00"}]
[{"$nulls":6},413,"#6",null,462,{"v":38,"d":"38.00"},{"$nulls":4},462,{"v":24,"d":"24.00"}]
[{"$nulls":6},414,"#6",null,463,{"v":38,"d":"38.00"},{"$nulls":4},463,{"v":24,"d":"24.00"}]
[{"$nulls":6},415,"#6",null,464,{"v":38,"d":"38.00"},{"$nulls":4},464,{"v":24,"d":"24.00"}]
[{"$nulls":6},416,"#6",null,465,{"v":38,"d":"38.00"},{"$nulls":4},465,{"v":24,"d":"24.00"}]
[{"$nulls":6},417,"#6",null,466,{"v":38,"d":"38.00"},{"$nulls":4},466,{"v":24,"d":"24.00"}]
[{"$nulls":6},418,"#6",null,467,{"v":38,"d":"38.00"},{"$nulls":4},467,{"v":24,"d":"24.00"}]
[{"$nulls":6},419,"#6",null,468,{"v":38,"d":"38.00"},{"$nulls":4},468,{"v":24,"d":"24.00"}]
[{"$nulls":6},420,"#6",null,469,{"v":38,"d":"38.00"},{"$nulls":4},469,{"v":24,"d":"24.00"}]
[{"$nulls":6},421,"#6",null,470,{"v":38,"d":"38.00"},{"$nulls":4},470,{"v":24,"d":"24.00"}]
[{"$nulls":6},422,"#6",null,471,{"v":38,"d":"38.00"},{"$nulls":4},471,{"v":24,"d":"24.00"}]
[{"$nulls":6},423,"#6",null,472,{"v":38,"d":"38.00"},{"$nulls":4},472,{"v":24,"d":"24.00"}]
[{"$nulls":6},424,"#6",null,473,{"v":38,"d":"38.00"},{"$nulls":4},473,{"v":24,"d":"24.00"}]
[{"$nulls":6},425,"#6",null,474,{"v":38,"d":"38.00"},{"$nulls":4},474,{"v":24,"d":"24.00"}]
[{"$nulls":6},426,"#6",null,475,{"v":38,"d":"38.00"},{"$nulls":4},475,{"v":24,"d":"24.00"}]
[{"$nulls":6},427,"#6",null,476,{"v":38,"d":"38.00"},{"$nulls":4},476,{"v":24,"d":"24.00"}]
[{"$nulls":6},428,"#6",null,477,{"v":38,"d":"38.00"},{"$nulls":4},477,{"v":24,"d":"24.00"}]
[{"$nulls":6},429,"#6",null,478,{"v":38,"d":"38.00"},{"$nulls":4},478,{"v":24,"d":"24.00"}]
[{"$nulls":6},430,"#6",null,479,{"v":38,"d":"38.00"},{"$nulls":4},479,{"v":24,"d":"24.00"}]
[{"$nulls":6},431,"#6",null,480,{"v":38,"d":"38.00"},{"$nulls":4},480,{"v":24,"d":"24.00"}]
[{"$nulls":6},432,"#6",null,481,{"v":38,"d":"38.00"},{"$nulls":4},481,{"v":24,"d":"24.00"}]
[{"$nulls":6},433,"#6",null,482,{"v":38,"d":"38.00"},{"$nulls":4},482,{"v":24,"d":"24.00"}]
[{"$nulls":6},434,"#6",null,483,{"v":38,"d":"38.00"},{"$nulls":4},483,{"v":24,"d":"24.00"}]
[{"$nulls":6},435,"#6",null,484,{"v":38,"d":"38.00"},{"$nulls":4},484,{"v":24,"d":"24.00"}]
[{"$nulls":6},436,"#6",null,{"$f":"+J442+1","v":485},{"v":38,"d":"38.00"},{"$nulls":4},{"$f":"+P442+1","v":485},{"v":24,"d":"24.00"}]
[{"$nulls":6},437,"#6",null,486,{"v":38,"d":"38.00"},{"$nulls":4},486,{"v":24,"d":"24.00"}]
[{"$nulls":6},438,"#6",null,487,{"v":38,"d":"38.00"},{"$nulls":4},487,{"v":24,"d":"24.00"}]
[{"$nulls":6},439,"#6",null,488,{"v":38,"d":"38.00"},{"$nulls":4},488,{"v":24,"d":"24.00"}]
[{"$nulls":6},440,"#6",null,489,{"v":38,"d":"38.00"},{"$nulls":4},489,{"v":24,"d":"24.00"}]
[{"$nulls":6},441,"#6",null,490,{"v":38,"d":"38.00"},{"$nulls":4},490,{"v":24,"d":"24.00"}]
[{"$nulls":6},442,"#6",null,491,{"v":38,"d":"38.00"},{"$nulls":4},491,{"v":24,"d":"24.00"}]
[{"$nulls":6},443,"#6",null,492,{"v":38,"d":"38.00"},{"$nulls":4},492,{"v":24,"d":"24.00"}]
[{"$nulls":6},444,"#6",null,493,{"v":38,"d":"38.00"},{"$nulls":4},493,{"v":24,"d":"24.00"}]
[{"$nulls":6},445,"#6",null,494,{"v":38,"d":"38.00"},{"$nulls":4},494,{"v":24,"d":"24.00"}]
[{"$nulls":6},446,"#6",null,495,{"v":38,"d":"38.00"},{"$nulls":4},495,{"v":24,"d":"24.00"}]
[{"$nulls":6},447,"#6",null,496,{"v":38,"d":"38.00"},{"$nulls":4},496,{"v":24,"d":"24.00"}]
[{"$nulls":6},448,"#6",null,497,{"v":38,"d":"38.00"},{"$nulls":4},497,{"v":24,"d":"24.00"}]
[{"$nulls":6},449,"#6",null,498,{"v":38,"d":"38.00"},{"$nulls":4},498,{"v":24,"d":"24.00"}]
[{"$nulls":6},450,"#6",null,499,{"v":38,"d":"38.00"},{"$nulls":4},499,{"v":24,"d":"24.00"}]
[{"$nulls":6},{"$f":"+G457+1","v":451},"#6"]
[{"$nulls":6},452,"#6"]
[{"$nulls":6},453,"#6"]
[{"$nulls":6},454,"#6"]
[{"$nulls":6},455,"#6"]
[{"$nulls":6},456,"#6"]
[{"$nulls":6},457,"#6"]
[{"$nulls":6},458,"#6"]
[{"$nulls":6},459,"#6"]
[{"$nulls":6},460,"#6"]
[{"$nulls":6},461,"#6"]
[{"$nulls":6},462,"#6"]
[{"$nulls":6},463,"#6"]
[{"$nulls":6},464,"#6"]
[{"$nulls":6},465,"#6"]
[{"$nulls":6},466,"#6"]
[{"$nulls":6},467,"#6"]
[{"$nulls":6},468,"#6"]
[{"$nulls":6},469,"#6"]
[{"$nulls":6},470,"#6"]
[{"$nulls":6},471,"#6"]
[{"$nulls":6},472,"#6"]
[{"$nulls":6},473,"#6"]
[{"$nulls":6},474,"#6"]
[{"$nulls":6},475,"#6"]
[{"$nulls":6},476,"#6"]
[{"$nulls":6},477,"#6"]
[{"$nulls":6},478,"#6"]
[{"$nulls":6},479,"#6"]
[{"$nulls":6},480,"#6"]
[{"$nulls":6},481,"#6"]
[{"$nulls":6},482,"#6"]
[{"$nulls":6},483,"#6"]
[{"$nulls":6},484,"#6"]
[{"$nulls":6},485,"#6"]
[{"$nulls":6},486,"#6"]
[{"$nulls":6},487,"#6"]
[{"$nulls":6},488,"#6"]
[{"$nulls":6},489,"#6"]
[{"$nulls":6},490,"#6"]
[{"$nulls":6},491,"#6"]
[{"$nulls":6},492,"#6"]
[{"$nulls":6},493,"#6"]
[{"$nulls":6},494,"#6"]
[{"$nulls":6},495,"#6"]
[{"$nulls":6},496,"#6"]
[{"$nulls":6},497,"#6"]
[{"$nulls":6},498,"#6"]
[{"$nulls":6},499,"#6"]

{"sheet":"ClassicBreakdown","index":6,"n_rows":53,"n_cols":17,"rows_kept":53,"hidden":true}
[]
[]
[]
[null,null,"QTY","Grandfather Price","Order Price Level","Order Price","Order Rate"]
[null,null,{"$f":"SUM(B8:C27)","v":0},{"$f":"IF(ISBLANK('Order Form'!B31),ClassicData!$E$8,VLOOKUP('Order Form'!B31,ClassicData!$D:$E,2,FALSE))","v":{"v":38,"d":"$38"}},{"$f":"IFERROR(VLOOKUP(C5,ClassicData!G:H,2,FALSE),\"#1\")","v":"#1"},{"$f":"VLOOKUP(E5,ClassicData!$D:$E,2,FALSE)","v":{"v":38,"d":"$38.00"}},{"$f":"MIN(D5,F5)","v":{"v":38,"d":"$38.00"}}]
[{"$nulls":4},{"$f":"VLOOKUP(E5,'Order Form'!F94:G99,2,FALSE)","v":1},{"$nulls":5},"QTY","Order Rate",{"$nulls":3},"QTY","Order Rate"]
[null,"Etched","ColorPrint",{"$nulls":7},{"$f":"SUM(J9:J28)","v":0},{"$f":"IF(K7<50,\"Less Than MOQ\",VLOOKUP(K7,ClassicData!$J:$K,2,FALSE))","v":"Less Than MOQ"},{"$nulls":3},{"$f":"SUM(O9:O28)","v":0},{"$f":"IF(P7<50,\"Less Than MOQ\",VLOOKUP(P7,ClassicData!$P:$Q,2,FALSE))","v":"Less Than MOQ"}]
[null,{"$f":"IF('Order Form'!B34=ClassicBreakdown!$B$7,+'Order Form'!I34,0)","v":0},{"$f":"IF('Order Form'!B34=ClassicBreakdown!$C$7,+'Order Form'!I34,0)","v":0},{"$nulls":6},"Embossed",{"$nulls":4},"CustomRibbon"]
[null,{"$f":"IF('Order Form'!B35=ClassicBreakdown!$B$7,+'Order Form'!I35,0)","v":0},{"$f":"IF('Order Form'!B35=ClassicBreakdown!$C$7,+'Order Form'!I35,0)","v":0},{"$nulls":6},{"$f":"IF('Order Form'!B34=ClassicBreakdown!$J$8,+'Order Form'!I34,0)","v":0},{"$nulls":4},{"$f":"IF('Order Form'!B34=ClassicBreakdown!$O$8,+'Order Form'!I34,0)","v":0}]
[null,{"$f":"IF('Order Form'!B36=ClassicBreakdown!$B$7,+'Order Form'!I36,0)","v":0},{"$f":"IF('Order Form'!B36=ClassicBreakdown!$C$7,+'Order Form'!I36,0)","v":0},{"$nulls":6},{"$f":"IF('Order Form'!B35=ClassicBreakdown!$J$8,+'Order Form'!I35,0)","v":0},{"$nulls":4},{"$f":"IF('Order Form'!B35=ClassicBreakdown!$O$8,+'Order Form'!I35,0)","v":0}]
[null,{"$f":"IF('Order Form'!B37=ClassicBreakdown!$B$7,+'Order Form'!I37,0)","v":0},{"$f":"IF('Order Form'!B37=ClassicBreakdown!$C$7,+'Order Form'!I37,0)","v":0},{"$nulls":6},{"$f":"IF('Order Form'!B36=ClassicBreakdown!$J$8,+'Order Form'!I36,0)","v":0},{"$nulls":4},{"$f":"IF('Order Form'!B36=ClassicBreakdown!$O$8,+'Order Form'!I36,0)","v":0}]
[null,{"$f":"IF('Order Form'!B38=ClassicBreakdown!$B$7,+'Order Form'!I38,0)","v":0},{"$f":"IF('Order Form'!B38=ClassicBreakdown!$C$7,+'Order Form'!I38,0)","v":0},{"$nulls":6},{"$f":"IF('Order Form'!B37=ClassicBreakdown!$J$8,+'Order Form'!I37,0)","v":0},{"$nulls":4},{"$f":"IF('Order Form'!B37=ClassicBreakdown!$O$8,+'Order Form'!I37,0)","v":0}]
[null,{"$f":"IF('Order Form'!B39=ClassicBreakdown!$B$7,+'Order Form'!I39,0)","v":0},{"$f":"IF('Order Form'!B39=ClassicBreakdown!$C$7,+'Order Form'!I39,0)","v":0},{"$nulls":6},{"$f":"IF('Order Form'!B38=ClassicBreakdown!$J$8,+'Order Form'!I38,0)","v":0},{"$nulls":4},{"$f":"IF('Order Form'!B38=ClassicBreakdown!$O$8,+'Order Form'!I38,0)","v":0}]
[null,{"$f":"IF('Order Form'!B40=ClassicBreakdown!$B$7,+'Order Form'!I40,0)","v":0},{"$f":"IF('Order Form'!B40=ClassicBreakdown!$C$7,+'Order Form'!I40,0)","v":0},{"$nulls":6},{"$f":"IF('Order Form'!B39=ClassicBreakdown!$J$8,+'Order Form'!I39,0)","v":0},{"$nulls":4},{"$f":"IF('Order Form'!B39=ClassicBreakdown!$O$8,+'Order Form'!I39,0)","v":0}]
[null,{"$f":"IF('Order Form'!B41=ClassicBreakdown!$B$7,+'Order Form'!I41,0)","v":0},{"$f":"IF('Order Form'!B41=ClassicBreakdown!$C$7,+'Order Form'!I41,0)","v":0},{"$nulls":6},{"$f":"IF('Order Form'!B40=ClassicBreakdown!$J$8,+'Order Form'!I40,0)","v":0},{"$nulls":4},{"$f":"IF('Order Form'!B40=ClassicBreakdown!$O$8,+'Order Form'!I40,0)","v":0}]
[null,{"$f":"IF('Order Form'!B42=ClassicBreakdown!$B$7,+'Order Form'!I42,0)","v":0},{"$f":"IF('Order Form'!B42=ClassicBreakdown!$C$7,+'Order Form'!I42,0)","v":0},{"$nulls":6},{"$f":"IF('Order Form'!B41=ClassicBreakdown!$J$8,+'Order Form'!I41,0)","v":0},{"$nulls":4},{"$f":"IF('Order Form'!B41=ClassicBreakdown!$O$8,+'Order Form'!I41,0)","v":0}]
[null,{"$f":"IF('Order Form'!B43=ClassicBreakdown!$B$7,+'Order Form'!I43,0)","v":0},{"$f":"IF('Order Form'!B43=ClassicBreakdown!$C$7,+'Order Form'!I43,0)","v":0},{"$nulls":6},{"$f":"IF('Order Form'!B42=ClassicBreakdown!$J$8,+'Order Form'!I42,0)","v":0},{"$nulls":4},{"$f":"IF('Order Form'!B42=ClassicBreakdown!$O$8,+'Order Form'!I42,0)","v":0}]
[null,{"$f":"IF('Order Form'!B44=ClassicBreakdown!$B$7,+'Order Form'!I44,0)","v":0},{"$f":"IF('Order Form'!B44=ClassicBreakdown!$C$7,+'Order Form'!I44,0)","v":0},{"$nulls":6},{"$f":"IF('Order Form'!B43=ClassicBreakdown!$J$8,+'Order Form'!I43,0)","v":0},{"$nulls":4},{"$f":"IF('Order Form'!B43=ClassicBreakdown!$O$8,+'Order Form'!I43,0)","v":0}]
[null,{"$f":"IF('Order Form'!B45=ClassicBreakdown!$B$7,+'Order Form'!I45,0)","v":0},{"$f":"IF('Order Form'!B45=ClassicBreakdown!$C$7,+'Order Form'!I45,0)","v":0},{"$nulls":6},{"$f":"IF('Order Form'!B44=ClassicBreakdown!$J$8,+'Order Form'!I44,0)","v":0},{"$nulls":4},{"$f":"IF('Order Form'!B44=ClassicBreakdown!$O$8,+'Order Form'!I44,0)","v":0}]
[null,{"$f":"IF('Order Form'!B46=ClassicBreakdown!$B$7,+'Order Form'!I46,0)","v":0},{"$f":"IF('Order Form'!B46=ClassicBreakdown!$C$7,+'Order Form'!I46,0)","v":0},{"$nulls":6},{"$f":"IF('Order Form'!B45=ClassicBreakdown!$J$8,+'Order Form'!I45,0)","v":0},{"$nulls":4},{"$f":"IF('Order Form'!B45=ClassicBreakdown!$O$8,+'Order Form'!I45,0)","v":0}]
[null,{"$f":"IF('Order Form'!B47=ClassicBreakdown!$B$7,+'Order Form'!I47,0)","v":0},{"$f":"IF('Order Form'!B47=ClassicBreakdown!$C$7,+'Order Form'!I47,0)","v":0},{"$nulls":6},{"$f":"IF('Order Form'!B46=ClassicBreakdown!$J$8,+'Order Form'!I46,0)","v":0},{"$nulls":4},{"$f":"IF('Order Form'!B46=ClassicBreakdown!$O$8,+'Order Form'!I46,0)","v":0}]
[null,{"$f":"IF('Order Form'!B48=ClassicBreakdown!$B$7,+'Order Form'!I48,0)","v":0},{"$f":"IF('Order Form'!B48=ClassicBreakdown!$C$7,+'Order Form'!I48,0)","v":0},{"$nulls":6},{"$f":"IF('Order Form'!B47=ClassicBreakdown!$J$8,+'Order Form'!I47,0)","v":0},{"$nulls":4},{"$f":"IF('Order Form'!B47=ClassicBreakdown!$O$8,+'Order Form'!I47,0)","v":0}]
[null,{"$f":"IF('Order Form'!B49=ClassicBreakdown!$B$7,+'Order Form'!I49,0)","v":0},{"$f":"IF('Order Form'!B49=ClassicBreakdown!$C$7,+'Order Form'!I49,0)","v":0},{"$nulls":6},{"$f":"IF('Order Form'!B48=ClassicBreakdown!$J$8,+'Order Form'!I48,0)","v":0},{"$nulls":4},{"$f":"IF('Order Form'!B48=ClassicBreakdown!$O$8,+'Order Form'!I48,0)","v":0}]
[null,{"$f":"IF('Order Form'!B50=ClassicBreakdown!$B$7,+'Order Form'!I50,0)","v":0},{"$f":"IF('Order Form'!B50=ClassicBreakdown!$C$7,+'Order Form'!I50,0)","v":0},{"$nulls":6},{"$f":"IF('Order Form'!B49=ClassicBreakdown!$J$8,+'Order Form'!I49,0)","v":0},{"$nulls":4},{"$f":"IF('Order Form'!B49=ClassicBreakdown!$O$8,+'Order Form'!I49,0)","v":0}]
[null,{"$f":"IF('Order Form'!B51=ClassicBreakdown!$B$7,+'Order Form'!I51,0)","v":0},{"$f":"IF('Order Form'!B51=ClassicBreakdown!$C$7,+'Order Form'!I51,0)","v":0},{"$nulls":6},{"$f":"IF('Order Form'!B50=ClassicBreakdown!$J$8,+'Order Form'!I50,0)","v":0},{"$nulls":4},{"$f":"IF('Order Form'!B50=ClassicBreakdown!$O$8,+'Order Form'!I50,0)","v":0}]
[null,{"$f":"IF('Order Form'!B52=ClassicBreakdown!$B$7,+'Order Form'!I52,0)","v":0},{"$f":"IF('Order Form'!B52=ClassicBreakdown!$C$7,+'Order Form'!I52,0)","v":0},{"$nulls":6},{"$f":"IF('Order Form'!B51=ClassicBreakdown!$J$8,+'Order Form'!I51,0)","v":0},{"$nulls":4},{"$f":"IF('Order Form'!B51=ClassicBreakdown!$O$8,+'Order Form'!I51,0)","v":0}]
[null,{"$f":"IF('Order Form'!B54=ClassicBreakdown!$B$7,+'Order Form'!H54,0)","v":0},{"$f":"IF('Order Form'!B54=ClassicBreakdown!$C$7,+'Order Form'!H54,0)","v":0},{"$nulls":6},{"$f":"IF('Order Form'!B52=ClassicBreakdown!$J$8,+'Order Form'!I52,0)","v":0},{"$nulls":4},{"$f":"IF('Order Form'!B52=ClassicBreakdown!$O$8,+'Order Form'!I52,0)","v":0}]
[{"$nulls":9},{"$f":"IF('Order Form'!B53=ClassicBreakdown!$J$8,+'Order Form'!I53,0)","v":0},{"$nulls":4},{"$f":"IF('Order Form'!B53=ClassicBreakdown!$O$8,+'Order Form'!I53,0)","v":0}]
[{"$nulls":10},"QTY","Order Rate"]
[{"$nulls":10},{"$f":"SUM(J32:J51)","v":0},{"$f":"IF(K30<200,\"Less Than MOQ\",VLOOKUP(K30,ClassicData!$M:$N,2,FALSE))","v":"Less Than MOQ"}]
[null,null,"QTY","Order Rate",{"$nulls":5},"PolishedPlate"]
[null,null,{"$f":"SUM(B34:B53)","v":0},{"$f":"IF(C32<50,\"Less Than MOQ\",VLOOKUP(C32,ClassicData!$J:$K,2,FALSE))","v":"Less Than MOQ"},{"$nulls":5},{"$f":"IF('Order Form'!B34=ClassicBreakdown!$J$31,+'Order Form'!I34,0)","v":0}]
[null,"Debossed",{"$nulls":7},{"$f":"IF('Order Form'!B35=ClassicBreakdown!$J$31,+'Order Form'!I35,0)","v":0}]
[null,{"$f":"IF('Order Form'!B34=ClassicBreakdown!$B$33,+'Order Form'!I34,0)","v":0},{"$nulls":7},{"$f":"IF('Order Form'!B36=ClassicBreakdown!$J$31,+'Order Form'!I36,0)","v":0}]
[null,{"$f":"IF('Order Form'!B35=ClassicBreakdown!$B$33,+'Order Form'!I35,0)","v":0},{"$nulls":7},{"$f":"IF('Order Form'!B37=ClassicBreakdown!$J$31,+'Order Form'!I37,0)","v":0}]
[null,{"$f":"IF('Order Form'!B36=ClassicBreakdown!$B$33,+'Order Form'!I36,0)","v":0},{"$nulls":7},{"$f":"IF('Order Form'!B38=ClassicBreakdown!$J$31,+'Order Form'!I38,0)","v":0}]
[null,{"$f":"IF('Order Form'!B37=ClassicBreakdown!$B$33,+'Order Form'!I37,0)","v":0},{"$nulls":7},{"$f":"IF('Order Form'!B39=ClassicBreakdown!$J$31,+'Order Form'!I39,0)","v":0}]
[null,{"$f":"IF('Order Form'!B38=ClassicBreakdown!$B$33,+'Order Form'!I38,0)","v":0},{"$nulls":7},{"$f":"IF('Order Form'!B40=ClassicBreakdown!$J$31,+'Order Form'!I40,0)","v":0}]
[null,{"$f":"IF('Order Form'!B39=ClassicBreakdown!$B$33,+'Order Form'!I39,0)","v":0},{"$nulls":7},{"$f":"IF('Order Form'!B41=ClassicBreakdown!$J$31,+'Order Form'!I41,0)","v":0}]
[null,{"$f":"IF('Order Form'!B40=ClassicBreakdown!$B$33,+'Order Form'!I40,0)","v":0},{"$nulls":7},{"$f":"IF('Order Form'!B42=ClassicBreakdown!$J$31,+'Order Form'!I42,0)","v":0}]
[null,{"$f":"IF('Order Form'!B41=ClassicBreakdown!$B$33,+'Order Form'!I41,0)","v":0},{"$nulls":7},{"$f":"IF('Order Form'!B43=ClassicBreakdown!$J$31,+'Order Form'!I43,0)","v":0}]
[null,{"$f":"IF('Order Form'!B42=ClassicBreakdown!$B$33,+'Order Form'!I42,0)","v":0},{"$nulls":7},{"$f":"IF('Order Form'!B44=ClassicBreakdown!$J$31,+'Order Form'!I44,0)","v":0}]
[null,{"$f":"IF('Order Form'!B43=ClassicBreakdown!$B$33,+'Order Form'!I43,0)","v":0},{"$nulls":7},{"$f":"IF('Order Form'!B45=ClassicBreakdown!$J$31,+'Order Form'!I45,0)","v":0}]
[null,{"$f":"IF('Order Form'!B44=ClassicBreakdown!$B$33,+'Order Form'!I44,0)","v":0},{"$nulls":7},{"$f":"IF('Order Form'!B46=ClassicBreakdown!$J$31,+'Order Form'!I46,0)","v":0}]
[null,{"$f":"IF('Order Form'!B45=ClassicBreakdown!$B$33,+'Order Form'!I45,0)","v":0},{"$nulls":7},{"$f":"IF('Order Form'!B47=ClassicBreakdown!$J$31,+'Order Form'!I47,0)","v":0}]
[null,{"$f":"IF('Order Form'!B46=ClassicBreakdown!$B$33,+'Order Form'!I46,0)","v":0},{"$nulls":7},{"$f":"IF('Order Form'!B48=ClassicBreakdown!$J$31,+'Order Form'!I48,0)","v":0}]
[null,{"$f":"IF('Order Form'!B47=ClassicBreakdown!$B$33,+'Order Form'!I47,0)","v":0},{"$nulls":7},{"$f":"IF('Order Form'!B49=ClassicBreakdown!$J$31,+'Order Form'!I49,0)","v":0}]
[null,{"$f":"IF('Order Form'!B48=ClassicBreakdown!$B$33,+'Order Form'!I48,0)","v":0},{"$nulls":7},{"$f":"IF('Order Form'!B50=ClassicBreakdown!$J$31,+'Order Form'!I50,0)","v":0}]
[null,{"$f":"IF('Order Form'!B49=ClassicBreakdown!$B$33,+'Order Form'!I49,0)","v":0},{"$nulls":7},{"$f":"IF('Order Form'!B51=ClassicBreakdown!$J$31,+'Order Form'!I51,0)","v":0}]
[null,{"$f":"IF('Order Form'!B50=ClassicBreakdown!$B$33,+'Order Form'!I50,0)","v":0},{"$nulls":7},{"$f":"IF('Order Form'!B52=ClassicBreakdown!$J$31,+'Order Form'!I52,0)","v":0}]
[null,{"$f":"IF('Order Form'!B51=ClassicBreakdown!$B$33,+'Order Form'!I51,0)","v":0},{"$nulls":7},{"$f":"IF('Order Form'!B53=ClassicBreakdown!$J$31,+'Order Form'!I53,0)","v":0}]
[null,{"$f":"IF('Order Form'!B52=ClassicBreakdown!$B$33,+'Order Form'!I52,0)","v":0}]
[null,{"$f":"IF('Order Form'!B53=ClassicBreakdown!$B$33,+'Order Form'!I53,0)","v":0}]

{"sheet":"BuckleData","index":7,"n_rows":506,"n_cols":18,"rows_kept":506,"hidden":true}
[]
[]
[]
[]
[{"$nulls":6},"Etched / Printed",null,null,"Embossed / Debossed",null,null,"Polished Plate",{"$nulls":3},"BM / Tool"]
[null,"Price Levels",null,"Price Sumamry",null,null,"Price Level",null,null,"Price Level",null,null,"Price Level",{"$nulls":3},"Price Adjust"]
[]
[null,"#1",null,"#1",{"v":18,"d":"18.00"},null,1,"#1",null,50,29,null,50,21,null,null,"Standard Ball Mark",0]
[null,"#2",null,"#2",{"v":17,"d":"17.00"},null,{"$f":"+G8+1","v":2},"#1",null,51,29,null,51,21,null,null,"Ball Mark - Etched Logo (add $3)",3]
[null,"#3",null,"#3",{"v":16,"d":"16.00"},null,{"$f":"+G9+1","v":3},"#1",null,52,29,null,52,21,null,null,"Ball Mark - Color Logo (add $3)",3]
[null,"#4",null,"#4",{"v":15,"d":"15.00"},null,4,"#1",null,53,29,null,53,21,null,null,"Divot Tool - Etched Logo (add $3)",3]
[null,"#5",null,"#5",{"v":13,"d":"13.00"},null,5,"#1",null,54,29,null,54,21,null,null,"Divot Tool - Color Logo (add $3)",3]
[null,"#6",null,"#6",{"v":11,"d":"11.00"},null,6,"#1",null,55,29,null,55,21,null,null,"Mark & Tool - Etched Logo (add $6)",6]
[{"$nulls":6},7,"#1",null,56,29,null,56,21,null,null,"Mark & Tool - Color Logo (add $6)",6]
[{"$nulls":6},8,"#1",null,57,29,null,57,21]
[{"$nulls":6},9,"#1",null,58,29,null,58,21]
[{"$nulls":6},10,"#1",null,59,29,null,59,21]
[{"$nulls":6},11,"#1",null,60,29,null,60,21]
[{"$nulls":6},12,"#1",null,61,29,null,61,21]
[{"$nulls":6},13,"#1",null,62,29,null,62,21]
[{"$nulls":6},14,"#1",null,63,29,null,63,21]
[{"$nulls":6},15,"#1",null,64,29,null,64,21]
[{"$nulls":6},16,"#1",null,65,29,null,65,21]
[{"$nulls":6},17,"#1",null,66,29,null,66,21]
[{"$nulls":6},18,"#1",null,67,29,null,67,21]
[{"$nulls":6},19,"#1",null,68,29,null,68,21]
[{"$nulls":6},20,"#1",null,69,29,null,69,21]
[{"$nulls":6},21,"#1",null,70,29,null,70,21]
[{"$nulls":6},22,"#1",null,71,29,null,71,21]
[{"$nulls":6},23,"#1",null,72,29,null,72,21]
[{"$nulls":6},24,"#2",null,73,29,null,73,21]
[{"$nulls":6},25,"#2",null,74,29,null,74,21]
[{"$nulls":6},26,"#2",null,75,29,null,75,21]
[{"$nulls":6},27,"#2",null,76,29,null,76,21]
[{"$nulls":6},28,"#2",null,77,29,null,77,21]
[{"$nulls":6},29,"#2",null,78,29,null,78,21]
[{"$nulls":6},30,"#2",null,79,29,null,79,21]
[{"$nulls":6},31,"#2",null,80,29,null,80,21]
[{"$nulls":6},32,"#2",null,81,29,null,81,21]
[{"$nulls":6},33,"#2",null,82,29,null,82,21]
[{"$nulls":6},34,"#2",null,83,29,null,83,21]
[{"$nulls":6},35,"#2",null,84,29,null,84,21]
[{"$nulls":6},36,"#2",null,85,29,null,85,21]
[{"$nulls":6},37,"#2",null,86,29,null,86,21]
[{"$nulls":6},38,"#2",null,87,29,null,87,21]
[{"$nulls":6},39,"#2",null,88,29,null,88,21]
[{"$nulls":6},40,"#2",null,89,29,null,89,21]
[{"$nulls":6},41,"#2",null,90,29,null,90,21]
[{"$nulls":6},42,"#2",null,91,29,null,91,21]
[{"$nulls":6},43,"#2",null,92,29,null,92,21]
[{"$nulls":6},44,"#2",null,93,29,null,93,21]
[{"$nulls":6},45,"#2",null,94,29,null,94,21]
[{"$nulls":6},46,"#2",null,95,29,null,95,21]
[{"$nulls":6},47,"#2",null,96,29,null,96,21]
[{"$nulls":6},48,"#2",null,97,29,null,97,21]
[{"$nulls":6},49,"#2",null,98,29,null,98,21]
[{"$nulls":6},50,"#2",null,99,29,null,99,21]
[{"$nulls":6},51,"#2",null,100,29,null,100,16]
[{"$nulls":6},52,"#2",null,{"$f":"+J58+1","v":101},29,null,101,16]
[{"$nulls":6},53,"#2",null,102,29,null,102,16]
[{"$nulls":6},54,"#2",null,103,29,null,103,16]
[{"$nulls":6},55,"#2",null,104,29,null,104,16]
[{"$nulls":6},56,"#2",null,105,29,null,105,16]
[{"$nulls":6},57,"#2",null,106,29,null,106,16]
[{"$nulls":6},58,"#2",null,107,29,null,107,16]
[{"$nulls":6},59,"#2",null,108,29,null,108,16]
[{"$nulls":6},60,"#2",null,109,29,null,109,16]
[{"$nulls":6},61,"#2",null,110,29,null,110,16]
[{"$nulls":6},62,"#2",null,111,29,null,111,16]
[{"$nulls":6},63,"#2",null,112,29,null,112,16]
[{"$nulls":6},64,"#2",null,113,29,null,113,16]
[{"$nulls":6},65,"#2",null,114,29,null,114,16]
[{"$nulls":6},66,"#2",null,115,29,null,115,16]
[{"$nulls":6},{"$f":"+G73+1","v":67},"#2",null,116,29,null,116,16]
[{"$nulls":6},68,"#2",null,117,29,null,117,16]
[{"$nulls":6},69,"#2",null,118,29,null,118,16]
[{"$nulls":6},70,"#2",null,119,29,null,119,16]
[{"$nulls":6},71,"#2",null,120,29,null,120,16]
[{"$nulls":6},72,"#2",null,121,29,null,121,16]
[{"$nulls":6},73,"#2",null,122,29,null,122,16]
[{"$nulls":6},74,"#2",null,123,29,null,123,16]
[{"$nulls":6},75,"#2",null,124,29,null,124,16]
[{"$nulls":6},76,"#2",null,125,29,null,125,16]
[{"$nulls":6},77,"#2",null,126,29,null,126,16]
[{"$nulls":6},78,"#2",null,127,29,null,127,16]
[{"$nulls":6},79,"#2",null,128,29,null,128,16]
[{"$nulls":6},80,"#2",null,129,29,null,129,16]
[{"$nulls":6},81,"#2",null,130,29,null,130,16]
[{"$nulls":6},82,"#2",null,131,29,null,131,16]
[{"$nulls":6},83,"#2",null,132,29,null,132,16]
[{"$nulls":6},84,"#2",null,133,29,null,133,16]
[{"$nulls":6},85,"#2",null,134,29,null,134,16]
[{"$nulls":6},86,"#2",null,135,29,null,135,16]
[{"$nulls":6},87,"#2",null,136,29,null,136,16]
[{"$nulls":6},88,"#2",null,137,29,null,137,16]
[{"$nulls":6},89,"#2",null,138,29,null,138,16]
[{"$nulls":6},90,"#2",null,139,29,null,139,16]
[{"$nulls":6},91,"#2",null,140,29,null,140,16]
[{"$nulls":6},92,"#2",null,141,29,null,141,16]
[{"$nulls":6},93,"#2",null,142,29,null,142,16]
[{"$nulls":6},94,"#2",null,143,29,null,143,16]
[{"$nulls":6},95,"#2",null,144,29,null,144,16]
[{"$nulls":6},96,"#2",null,145,29,null,145,16]
[{"$nulls":6},97,"#2",null,146,29,null,146,16]
[{"$nulls":6},98,"#2",null,147,29,null,147,16]
[{"$nulls":6},99,"#2",null,148,29,null,148,16]
[{"$nulls":6},100,"#3",null,149,29,null,149,16]
[{"$nulls":6},101,"#3",null,150,29,null,150,16]
[{"$nulls":6},102,"#3",null,151,29,null,151,16]
[{"$nulls":6},103,"#3",null,152,29,null,152,16]
[{"$nulls":6},104,"#3",null,153,29,null,153,16]
[{"$nulls":6},105,"#3",null,154,29,null,154,16]
[{"$nulls":6},106,"#3",null,155,29,null,155,16]
[{"$nulls":6},107,"#3",null,156,29,null,156,16]
[{"$nulls":6},108,"#3",null,157,29,null,157,16]
[{"$nulls":6},109,"#3",null,158,29,null,158,16]
[{"$nulls":6},110,"#3",null,159,29,null,159,16]
[{"$nulls":6},111,"#3",null,160,29,null,160,16]
[{"$nulls":6},112,"#3",null,161,29,null,161,16]
[{"$nulls":6},113,"#3",null,162,29,null,162,16]
[{"$nulls":6},114,"#3",null,163,29,null,163,16]
[{"$nulls":6},115,"#3",null,164,29,null,164,16]
[{"$nulls":6},116,"#3",null,{"$f":"+J122+1","v":165},29,null,165,16]
[{"$nulls":6},117,"#3",null,166,29,null,166,16]
[{"$nulls":6},118,"#3",null,167,29,null,167,16]
[{"$nulls":6},119,"#3",null,168,29,null,168,16]
[{"$nulls":6},120,"#3",null,169,29,null,169,16]
[{"$nulls":6},121,"#3",null,170,29,null,170,16]
[{"$nulls":6},122,"#3",null,171,29,null,171,16]
[{"$nulls":6},123,"#3",null,172,29,null,172,16]
[{"$nulls":6},124,"#3",null,173,29,null,173,16]
[{"$nulls":6},125,"#3",null,174,29,null,174,16]
[{"$nulls":6},126,"#3",null,175,29,null,175,16]
[{"$nulls":6},127,"#3",null,176,29,null,176,16]
[{"$nulls":6},128,"#3",null,177,29,null,177,16]
[{"$nulls":6},129,"#3",null,178,29,null,178,16]
[{"$nulls":6},130,"#3",null,179,29,null,179,16]
[{"$nulls":6},{"$f":"+G137+1","v":131},"#3",null,180,29,null,180,16]
[{"$nulls":6},132,"#3",null,181,29,null,181,16]
[{"$nulls":6},133,"#3",null,182,29,null,182,16]
[{"$nulls":6},134,"#3",null,183,29,null,183,16]
[{"$nulls":6},135,"#3",null,184,29,null,184,16]
[{"$nulls":6},136,"#3",null,185,29,null,185,16]
[{"$nulls":6},137,"#3",null,186,29,null,186,16]
[{"$nulls":6},138,"#3",null,187,29,null,187,16]
[{"$nulls":6},139,"#3",null,188,29,null,188,16]
[{"$nulls":6},140,"#3",null,189,29,null,189,16]
[{"$nulls":6},141,"#3",null,190,29,null,190,16]
[{"$nulls":6},142,"#3",null,191,29,null,191,16]
[{"$nulls":6},143,"#3",null,192,29,null,192,16]
[{"$nulls":6},144,"#3",null,193,29,null,193,16]
[{"$nulls":6},145,"#3",null,194,29,null,194,16]
[{"$nulls":6},146,"#3",null,195,29,null,195,16]
[{"$nulls":6},147,"#3",null,196,29,null,196,16]
[{"$nulls":6},148,"#3",null,197,29,null,197,16]
[{"$nulls":6},149,"#3",null,198,29,null,198,16]
[{"$nulls":6},150,"#3",null,199,29,null,199,16]
[{"$nulls":6},151,"#3",null,200,25,null,200,13]
[{"$nulls":6},152,"#3",null,201,25,null,201,13]
[{"$nulls":6},153,"#3",null,202,25,null,202,13]
[{"$nulls":6},154,"#3",null,203,25,null,203,13]
[{"$nulls":6},155,"#3",null,204,25,null,204,13]
[{"$nulls":6},156,"#3",null,205,25,null,205,13]
[{"$nulls":6},157,"#3",null,206,25,null,206,13]
[{"$nulls":6},158,"#3",null,207,25,null,207,13]
[{"$nulls":6},159,"#3",null,208,25,null,208,13]
[{"$nulls":6},160,"#3",null,209,25,null,209,13]
[{"$nulls":6},161,"#3",null,210,25,null,210,13]
[{"$nulls":6},162,"#3",null,211,25,null,211,13]
[{"$nulls":6},163,"#3",null,212,25,null,212,13]
[{"$nulls":6},164,"#3",null,213,25,null,213,13]
[{"$nulls":6},165,"#3",null,214,25,null,214,13]
[{"$nulls":6},166,"#3",null,215,25,null,215,13]
[{"$nulls":6},167,"#3",null,216,25,null,216,13]
[{"$nulls":6},168,"#3",null,217,25,null,217,13]
[{"$nulls":6},169,"#3",null,218,25,null,218,13]
[{"$nulls":6},170,"#3",null,219,25,null,219,13]
[{"$nulls":6},171,"#3",null,220,25,null,220,13]
[{"$nulls":6},172,"#3",null,221,25,null,221,13]
[{"$nulls":6},173,"#3",null,222,25,null,222,13]
[{"$nulls":6},174,"#3",null,223,25,null,223,13]
[{"$nulls":6},175,"#3",null,224,25,null,224,13]
[{"$nulls":6},176,"#3",null,225,25,null,225,13]
[{"$nulls":6},177,"#3",null,226,25,null,226,13]
[{"$nulls":6},178,"#3",null,227,25,null,227,13]
[{"$nulls":6},179,"#3",null,228,25,null,228,13]
[{"$nulls":6},180,"#3",null,{"$f":"+J186+1","v":229},25,null,229,13]
[{"$nulls":6},181,"#3",null,230,25,null,230,13]
[{"$nulls":6},182,"#3",null,231,25,null,231,13]
[{"$nulls":6},183,"#3",null,232,25,null,232,13]
[{"$nulls":6},184,"#3",null,233,25,null,233,13]
[{"$nulls":6},185,"#3",null,234,25,null,234,13]
[{"$nulls":6},186,"#3",null,235,25,null,235,13]
[{"$nulls":6},187,"#3",null,236,25,null,236,13]
[{"$nulls":6},188,"#3",null,237,25,null,237,13]
[{"$nulls":6},189,"#3",null,238,25,null,238,13]
[{"$nulls":6},190,"#3",null,239,25,null,239,13]
[{"$nulls":6},191,"#3",null,240,25,null,240,13]
[{"$nulls":6},192,"#3",null,241,25,null,241,13]
[{"$nulls":6},193,"#3",null,242,25,null,242,13]
[{"$nulls":6},194,"#3",null,243,25,null,243,13]
[{"$nulls":6},{"$f":"+G201+1","v":195},"#3",null,244,25,null,244,13]
[{"$nulls":6},196,"#3",null,245,25,null,245,13]
[{"$nulls":6},197,"#3",null,246,25,null,246,13]
[{"$nulls":6},198,"#3",null,247,25,null,247,13]
[{"$nulls":6},199,"#3",null,248,25,null,248,13]
[{"$nulls":6},200,"#4",null,249,25,null,249,13]
[{"$nulls":6},201,"#4",null,250,20,null,250,10]
[{"$nulls":6},202,"#4",null,251,20,null,251,10]
[{"$nulls":6},203,"#4",null,252,20,null,252,10]
[{"$nulls":6},204,"#4",null,253,20,null,253,10]
[{"$nulls":6},205,"#4",null,254,20,null,254,10]
[{"$nulls":6},206,"#4",null,255,20,null,255,10]
[{"$nulls":6},207,"#4",null,256,20,null,256,10]
[{"$nulls":6},208,"#4",null,257,20,null,257,10]
[{"$nulls":6},209,"#4",null,258,20,null,258,10]
[{"$nulls":6},210,"#4",null,259,20,null,259,10]
[{"$nulls":6},211,"#4",null,260,20,null,260,10]
[{"$nulls":6},212,"#4",null,261,20,null,261,10]
[{"$nulls":6},213,"#4",null,262,20,null,262,10]
[{"$nulls":6},214,"#4",null,263,20,null,263,10]
[{"$nulls":6},215,"#4",null,264,20,null,264,10]
[{"$nulls":6},216,"#4",null,265,20,null,265,10]
[{"$nulls":6},217,"#4",null,266,20,null,266,10]
[{"$nulls":6},218,"#4",null,267,20,null,267,10]
[{"$nulls":6},219,"#4",null,268,20,null,268,10]
[{"$nulls":6},220,"#4",null,269,20,null,269,10]
[{"$nulls":6},221,"#4",null,270,20,null,270,10]
[{"$nulls":6},222,"#4",null,271,20,null,271,10]
[{"$nulls":6},223,"#4",null,272,20,null,272,10]
[{"$nulls":6},224,"#4",null,273,20,null,273,10]
[{"$nulls":6},225,"#4",null,274,20,null,274,10]
[{"$nulls":6},226,"#4",null,275,20,null,275,10]
[{"$nulls":6},227,"#4",null,276,20,null,276,10]
[{"$nulls":6},228,"#4",null,277,20,null,277,10]
[{"$nulls":6},229,"#4",null,278,20,null,278,10]
[{"$nulls":6},230,"#4",null,279,20,null,279,10]
[{"$nulls":6},231,"#4",null,280,20,null,280,10]
[{"$nulls":6},232,"#4",null,281,20,null,281,10]
[{"$nulls":6},233,"#4",null,282,20,null,282,10]
[{"$nulls":6},234,"#4",null,283,20,null,283,10]
[{"$nulls":6},235,"#4",null,284,20,null,284,10]
[{"$nulls":6},236,"#4",null,285,20,null,285,10]
[{"$nulls":6},237,"#4",null,286,20,null,286,10]
[{"$nulls":6},238,"#4",null,287,20,null,287,10]
[{"$nulls":6},239,"#4",null,288,20,null,288,10]
[{"$nulls":6},240,"#4",null,289,20,null,289,10]
[{"$nulls":6},241,"#4",null,290,20,null,290,10]
[{"$nulls":6},242,"#4",null,291,20,null,291,10]
[{"$nulls":6},243,"#4",null,292,20,null,292,10]
[{"$nulls":6},244,"#4",null,{"$f":"+J250+1","v":293},20,null,293,10]
[{"$nulls":6},245,"#4",null,294,20,null,294,10]
[{"$nulls":6},246,"#4",null,295,20,null,295,10]
[{"$nulls":6},247,"#4",null,296,20,null,296,10]
[{"$nulls":6},248,"#4",null,297,20,null,297,10]
[{"$nulls":6},249,"#4",null,298,20,null,298,10]
[{"$nulls":6},250,"#5",null,299,20,null,299,10]
[{"$nulls":6},251,"#5",null,300,20,null,300,10]
[{"$nulls":6},252,"#5",null,301,20,null,301,10]
[{"$nulls":6},253,"#5",null,302,20,null,302,10]
[{"$nulls":6},254,"#5",null,303,20,null,303,10]
[{"$nulls":6},255,"#5",null,304,20,null,304,10]
[{"$nulls":6},256,"#5",null,305,20,null,305,10]
[{"$nulls":6},257,"#5",null,306,20,null,306,10]
[{"$nulls":6},258,"#5",null,307,20,null,307,10]
[{"$nulls":6},{"$f":"+G265+1","v":259},"#5",null,308,20,null,308,10]
[{"$nulls":6},260,"#5",null,309,20,null,309,10]
[{"$nulls":6},261,"#5",null,310,20,null,310,10]
[{"$nulls":6},262,"#5",null,311,20,null,311,10]
[{"$nulls":6},263,"#5",null,312,20,null,312,10]
[{"$nulls":6},264,"#5",null,313,20,null,313,10]
[{"$nulls":6},265,"#5",null,314,20,null,314,10]
[{"$nulls":6},266,"#5",null,315,20,null,315,10]
[{"$nulls":6},267,"#5",null,316,20,null,316,10]
[{"$nulls":6},268,"#5",null,317,20,null,317,10]
[{"$nulls":6},269,"#5",null,318,20,null,318,10]
[{"$nulls":6},270,"#5",null,319,20,null,319,10]
[{"$nulls":6},271,"#5",null,320,20,null,320,10]
[{"$nulls":6},272,"#5",null,321,20,null,321,10]
[{"$nulls":6},273,"#5",null,322,20,null,322,10]
[{"$nulls":6},274,"#5",null,323,20,null,323,10]
[{"$nulls":6},275,"#5",null,324,20,null,324,10]
[{"$nulls":6},276,"#5",null,325,20,null,325,10]
[{"$nulls":6},277,"#5",null,326,20,null,326,10]
[{"$nulls":6},278,"#5",null,327,20,null,327,10]
[{"$nulls":6},279,"#5",null,328,20,null,328,10]
[{"$nulls":6},280,"#5",null,329,20,null,329,10]
[{"$nulls":6},281,"#5",null,330,20,null,330,10]
[{"$nulls":6},282,"#5",null,331,20,null,331,10]
[{"$nulls":6},283,"#5",null,332,20,null,332,10]
[{"$nulls":6},284,"#5",null,333,20,null,333,10]
[{"$nulls":6},285,"#5",null,334,20,null,334,10]
[{"$nulls":6},286,"#5",null,335,20,null,335,10]
[{"$nulls":6},287,"#5",null,336,20,null,336,10]
[{"$nulls":6},288,"#5",null,337,20,null,337,10]
[{"$nulls":6},289,"#5",null,338,20,null,338,10]
[{"$nulls":6},290,"#5",null,339,20,null,339,10]
[{"$nulls":6},291,"#5",null,340,20,null,340,10]
[{"$nulls":6},292,"#5",null,341,20,null,341,10]
[{"$nulls":6},293,"#5",null,342,20,null,342,10]
[{"$nulls":6},294,"#5",null,343,20,null,343,10]
[{"$nulls":6},295,"#5",null,344,20,null,344,10]
[{"$nulls":6},296,"#5",null,345,20,null,345,10]
[{"$nulls":6},297,"#5",null,346,20,null,346,10]
[{"$nulls":6},298,"#5",null,347,20,null,347,10]
[{"$nulls":6},299,"#5",null,348,20,null,348,10]
[{"$nulls":6},300,"#5",null,349,20,null,349,10]
[{"$nulls":6},301,"#5",null,350,18,null,350,9]
[{"$nulls":6},302,"#5",null,351,18,null,351,9]
[{"$nulls":6},303,"#5",null,352,18,null,352,9]
[{"$nulls":6},304,"#5",null,353,18,null,353,9]
[{"$nulls":6},305,"#5",null,354,18,null,354,9]
[{"$nulls":6},306,"#5",null,355,18,null,355,9]
[{"$nulls":6},307,"#5",null,356,18,null,356,9]
[{"$nulls":6},308,"#5",null,{"$f":"+J314+1","v":357},18,null,357,9]
[{"$nulls":6},309,"#5",null,358,18,null,358,9]
[{"$nulls":6},310,"#5",null,359,18,null,359,9]
[{"$nulls":6},311,"#5",null,360,18,null,360,9]
[{"$nulls":6},312,"#5",null,361,18,null,361,9]
[{"$nulls":6},313,"#5",null,362,18,null,362,9]
[{"$nulls":6},314,"#5",null,363,18,null,363,9]
[{"$nulls":6},315,"#5",null,364,18,null,364,9]
[{"$nulls":6},316,"#5",null,365,18,null,365,9]
[{"$nulls":6},317,"#5",null,366,18,null,366,9]
[{"$nulls":6},318,"#5",null,367,18,null,367,9]
[{"$nulls":6},319,"#5",null,368,18,null,368,9]
[{"$nulls":6},320,"#5",null,369,18,null,369,9]
[{"$nulls":6},321,"#5",null,370,18,null,370,9]
[{"$nulls":6},322,"#5",null,371,18,null,371,9]
[{"$nulls":6},{"$f":"+G329+1","v":323},"#5",null,372,18,null,372,9]
[{"$nulls":6},324,"#5",null,373,18,null,373,9]
[{"$nulls":6},325,"#5",null,374,18,null,374,9]
[{"$nulls":6},326,"#5",null,375,18,null,375,9]
[{"$nulls":6},327,"#5",null,376,18,null,376,9]
[{"$nulls":6},328,"#5",null,377,18,null,377,9]
[{"$nulls":6},329,"#5",null,378,18,null,378,9]
[{"$nulls":6},330,"#5",null,379,18,null,379,9]
[{"$nulls":6},331,"#5",null,380,18,null,380,9]
[{"$nulls":6},332,"#5",null,381,18,null,381,9]
[{"$nulls":6},333,"#5",null,382,18,null,382,9]
[{"$nulls":6},334,"#5",null,383,18,null,383,9]
[{"$nulls":6},335,"#5",null,384,18,null,384,9]
[{"$nulls":6},336,"#5",null,385,18,null,385,9]
[{"$nulls":6},337,"#5",null,386,18,null,386,9]
[{"$nulls":6},338,"#5",null,387,18,null,387,9]
[{"$nulls":6},339,"#5",null,388,18,null,388,9]
[{"$nulls":6},340,"#5",null,389,18,null,389,9]
[{"$nulls":6},341,"#5",null,390,18,null,390,9]
[{"$nulls":6},342,"#5",null,391,18,null,391,9]
[{"$nulls":6},343,"#5",null,392,18,null,392,9]
[{"$nulls":6},344,"#5",null,393,18,null,393,9]
[{"$nulls":6},345,"#5",null,394,18,null,394,9]
[{"$nulls":6},346,"#5",null,395,18,null,395,9]
[{"$nulls":6},347,"#5",null,396,18,null,396,9]
[{"$nulls":6},348,"#5",null,397,18,null,397,9]
[{"$nulls":6},349,"#5",null,398,18,null,398,9]
[{"$nulls":6},350,"#6",null,399,18,null,399,9]
[{"$nulls":6},351,"#6",null,400,18,null,400,9]
[{"$nulls":6},352,"#6",null,401,18,null,401,9]
[{"$nulls":6},353,"#6",null,402,18,null,402,9]
[{"$nulls":6},354,"#6",null,403,18,null,403,9]
[{"$nulls":6},355,"#6",null,404,18,null,404,9]
[{"$nulls":6},356,"#6",null,405,18,null,405,9]
[{"$nulls":6},357,"#6",null,406,18,null,406,9]
[{"$nulls":6},358,"#6",null,407,18,null,407,9]
[{"$nulls":6},359,"#6",null,408,18,null,408,9]
[{"$nulls":6},360,"#6",null,409,18,null,409,9]
[{"$nulls":6},361,"#6",null,410,18,null,410,9]
[{"$nulls":6},362,"#6",null,411,18,null,411,9]
[{"$nulls":6},363,"#6",null,412,18,null,412,9]
[{"$nulls":6},364,"#6",null,413,18,null,413,9]
[{"$nulls":6},365,"#6",null,414,18,null,414,9]
[{"$nulls":6},366,"#6",null,415,18,null,415,9]
[{"$nulls":6},367,"#6",null,416,18,null,416,9]
[{"$nulls":6},368,"#6",null,417,18,null,417,9]
[{"$nulls":6},369,"#6",null,418,18,null,418,9]
[{"$nulls":6},370,"#6",null,419,18,null,419,9]
[{"$nulls":6},371,"#6",null,420,18,null,420,9]
[{"$nulls":6},372,"#6",null,{"$f":"+J378+1","v":421},18,null,421,9]
[{"$nulls":6},373,"#6",null,422,18,null,422,9]
[{"$nulls":6},374,"#6",null,423,18,null,423,9]
[{"$nulls":6},375,"#6",null,424,18,null,424,9]
[{"$nulls":6},376,"#6",null,425,18,null,425,9]
[{"$nulls":6},377,"#6",null,426,18,null,426,9]
[{"$nulls":6},378,"#6",null,427,18,null,427,9]
[{"$nulls":6},379,"#6",null,428,18,null,428,9]
[{"$nulls":6},380,"#6",null,429,18,null,429,9]
[{"$nulls":6},381,"#6",null,430,18,null,430,9]
[{"$nulls":6},382,"#6",null,431,18,null,431,9]
[{"$nulls":6},383,"#6",null,432,18,null,432,9]
[{"$nulls":6},384,"#6",null,433,18,null,433,9]
[{"$nulls":6},385,"#6",null,434,18,null,434,9]
[{"$nulls":6},386,"#6",null,435,18,null,435,9]
[{"$nulls":6},{"$f":"+G393+1","v":387},"#6",null,436,18,null,436,9]
[{"$nulls":6},388,"#6",null,437,18,null,437,9]
[{"$nulls":6},389,"#6",null,438,18,null,438,9]
[{"$nulls":6},390,"#6",null,439,18,null,439,9]
[{"$nulls":6},391,"#6",null,440,18,null,440,9]
[{"$nulls":6},392,"#6",null,441,18,null,441,9]
[{"$nulls":6},393,"#6",null,442,18,null,442,9]
[{"$nulls":6},394,"#6",null,443,18,null,443,9]
[{"$nulls":6},395,"#6",null,444,18,null,444,9]
[{"$nulls":6},396,"#6",null,445,18,null,445,9]
[{"$nulls":6},397,"#6",null,446,18,null,446,9]
[{"$nulls":6},398,"#6",null,447,18,null,447,9]
[{"$nulls":6},399,"#6",null,448,18,null,448,9]
[{"$nulls":6},400,"#6",null,449,18,null,449,9]
[{"$nulls":6},401,"#6",null,450,18,null,450,9]
[{"$nulls":6},402,"#6",null,451,18,null,451,9]
[{"$nulls":6},403,"#6",null,452,18,null,452,9]
[{"$nulls":6},404,"#6",null,453,18,null,453,9]
[{"$nulls":6},405,"#6",null,454,18,null,454,9]
[{"$nulls":6},406,"#6",null,455,18,null,455,9]
[{"$nulls":6},407,"#6",null,456,18,null,456,9]
[{"$nulls":6},408,"#6",null,457,18,null,457,9]
[{"$nulls":6},409,"#6",null,458,18,null,458,9]
[{"$nulls":6},410,"#6",null,459,18,null,459,9]
[{"$nulls":6},411,"#6",null,460,18,null,460,9]
[{"$nulls":6},412,"#6",null,461,18,null,461,9]
[{"$nulls":6},413,"#6",null,462,18,null,462,9]
[{"$nulls":6},414,"#6",null,463,18,null,463,9]
[{"$nulls":6},415,"#6",null,464,18,null,464,9]
[{"$nulls":6},416,"#6",null,465,18,null,465,9]
[{"$nulls":6},417,"#6",null,466,18,null,466,9]
[{"$nulls":6},418,"#6",null,467,18,null,467,9]
[{"$nulls":6},419,"#6",null,468,18,null,468,9]
[{"$nulls":6},420,"#6",null,469,18,null,469,9]
[{"$nulls":6},421,"#6",null,470,18,null,470,9]
[{"$nulls":6},422,"#6",null,471,18,null,471,9]
[{"$nulls":6},423,"#6",null,472,18,null,472,9]
[{"$nulls":6},424,"#6",null,473,18,null,473,9]
[{"$nulls":6},425,"#6",null,474,18,null,474,9]
[{"$nulls":6},426,"#6",null,475,18,null,475,9]
[{"$nulls":6},427,"#6",null,476,18,null,476,9]
[{"$nulls":6},428,"#6",null,477,18,null,477,9]
[{"$nulls":6},429,"#6",null,478,18,null,478,9]
[{"$nulls":6},430,"#6",null,479,18,null,479,9]
[{"$nulls":6},431,"#6",null,480,18,null,480,9]
[{"$nulls":6},432,"#6",null,481,18,null,481,9]
[{"$nulls":6},433,"#6",null,482,18,null,482,9]
[{"$nulls":6},434,"#6",null,483,18,null,483,9]
[{"$nulls":6},435,"#6",null,484,18,null,484,9]
[{"$nulls":6},436,"#6",null,{"$f":"+J442+1","v":485},18,null,485,9]
[{"$nulls":6},437,"#6",null,486,18,null,486,9]
[{"$nulls":6},438,"#6",null,487,18,null,487,9]
[{"$nulls":6},439,"#6",null,488,18,null,488,9]
[{"$nulls":6},440,"#6",null,489,18,null,489,9]
[{"$nulls":6},441,"#6",null,490,18,null,490,9]
[{"$nulls":6},442,"#6",null,491,18,null,491,9]
[{"$nulls":6},443,"#6",null,492,18,null,492,9]
[{"$nulls":6},444,"#6",null,493,18,null,493,9]
[{"$nulls":6},445,"#6",null,494,18,null,494,9]
[{"$nulls":6},446,"#6",null,495,18,null,495,9]
[{"$nulls":6},447,"#6",null,496,18,null,496,9]
[{"$nulls":6},448,"#6",null,497,18,null,497,9]
[{"$nulls":6},449,"#6",null,498,18,null,498,9]
[{"$nulls":6},450,"#6",null,499,18,null,499,9]
[{"$nulls":6},{"$f":"+G457+1","v":451},"#6"]
[{"$nulls":6},452,"#6"]
[{"$nulls":6},453,"#6"]
[{"$nulls":6},454,"#6"]
[{"$nulls":6},455,"#6"]
[{"$nulls":6},456,"#6"]
[{"$nulls":6},457,"#6"]
[{"$nulls":6},458,"#6"]
[{"$nulls":6},459,"#6"]
[{"$nulls":6},460,"#6"]
[{"$nulls":6},461,"#6"]
[{"$nulls":6},462,"#6"]
[{"$nulls":6},463,"#6"]
[{"$nulls":6},464,"#6"]
[{"$nulls":6},465,"#6"]
[{"$nulls":6},466,"#6"]
[{"$nulls":6},467,"#6"]
[{"$nulls":6},468,"#6"]
[{"$nulls":6},469,"#6"]
[{"$nulls":6},470,"#6"]
[{"$nulls":6},471,"#6"]
[{"$nulls":6},472,"#6"]
[{"$nulls":6},473,"#6"]
[{"$nulls":6},474,"#6"]
[{"$nulls":6},475,"#6"]
[{"$nulls":6},476,"#6"]
[{"$nulls":6},477,"#6"]
[{"$nulls":6},478,"#6"]
[{"$nulls":6},479,"#6"]
[{"$nulls":6},480,"#6"]
[{"$nulls":6},481,"#6"]
[{"$nulls":6},482,"#6"]
[{"$nulls":6},483,"#6"]
[{"$nulls":6},484,"#6"]
[{"$nulls":6},485,"#6"]
[{"$nulls":6},486,"#6"]
[{"$nulls":6},487,"#6"]
[{"$nulls":6},488,"#6"]
[{"$nulls":6},489,"#6"]
[{"$nulls":6},490,"#6"]
[{"$nulls":6},491,"#6"]
[{"$nulls":6},492,"#6"]
[{"$nulls":6},493,"#6"]
[{"$nulls":6},494,"#6"]
[{"$nulls":6},495,"#6"]
[{"$nulls":6},496,"#6"]
[{"$nulls":6},497,"#6"]
[{"$nulls":6},498,"#6"]
[{"$nulls":6},499,"#6"]

{"sheet":"BuckleBreakdown","index":8,"n_rows":33,"n_cols":12,"rows_kept":33,"hidden":true}
[]
[]
[]
[null,null,"QTY","Grandfather Price","Order Price Level","Order Price","Order Rate"]
[null,null,{"$f":"SUM(B8:C17)","v":0},{"$f":"IF(ISBLANK('Order Form'!B31),BuckleData!E8,VLOOKUP('Order Form'!B31,BuckleData!$D:$E,2,FALSE))","v":{"v":18,"d":"$18"}},{"$f":"IFERROR(VLOOKUP(C5,BuckleData!G:H,2,FALSE),\"#1\")","v":"#1"},{"$f":"VLOOKUP(E5,BuckleData!$D:$E,2,FALSE)","v":{"v":18,"d":"$18.00"}},{"$f":"MIN(D5,F5)","v":{"v":18,"d":"$18.00"}}]
[{"$nulls":4},{"$f":"VLOOKUP(E5,'Order Form'!F94:G99,2,FALSE)","v":1},{"$nulls":5},"QTY","Order Rate"]
[null,"Etched","ColorPrint",{"$nulls":7},{"$f":"SUM(J9:J18)","v":0},{"$f":"IF(K7<50,\"Less Than MOQ\",VLOOKUP(K7,BuckleData!$J:$K,2,FALSE))","v":"Less Than MOQ"}]
[null,{"$f":"IF('Order Form'!B58=BuckleBreakdown!$B$7,+'Order Form'!I58,0)","v":0},{"$f":"IF('Order Form'!B58=BuckleBreakdown!$C$7,+'Order Form'!I58,0)","v":0},{"$nulls":6},"Embossed"]
[null,{"$f":"IF('Order Form'!B59=BuckleBreakdown!$B$7,+'Order Form'!I59,0)","v":0},{"$f":"IF('Order Form'!B59=BuckleBreakdown!$C$7,+'Order Form'!I59,0)","v":0},{"$nulls":6},{"$f":"IF('Order Form'!B58=BuckleBreakdown!$J$8,+'Order Form'!I58,0)","v":0}]
[null,{"$f":"IF('Order Form'!B60=BuckleBreakdown!$B$7,+'Order Form'!I60,0)","v":0},{"$f":"IF('Order Form'!B60=BuckleBreakdown!$C$7,+'Order Form'!I60,0)","v":0},{"$nulls":6},{"$f":"IF('Order Form'!B59=BuckleBreakdown!$J$8,+'Order Form'!I59,0)","v":0}]
[null,{"$f":"IF('Order Form'!B61=BuckleBreakdown!$B$7,+'Order Form'!I61,0)","v":0},{"$f":"IF('Order Form'!B61=BuckleBreakdown!$C$7,+'Order Form'!I61,0)","v":0},{"$nulls":6},{"$f":"IF('Order Form'!B60=BuckleBreakdown!$J$8,+'Order Form'!I60,0)","v":0}]
[null,{"$f":"IF('Order Form'!B62=BuckleBreakdown!$B$7,+'Order Form'!I62,0)","v":0},{"$f":"IF('Order Form'!B62=BuckleBreakdown!$C$7,+'Order Form'!I62,0)","v":0},{"$nulls":6},{"$f":"IF('Order Form'!B61=BuckleBreakdown!$J$8,+'Order Form'!I61,0)","v":0}]
[null,{"$f":"IF('Order Form'!B63=BuckleBreakdown!$B$7,+'Order Form'!I63,0)","v":0},{"$f":"IF('Order Form'!B63=BuckleBreakdown!$C$7,+'Order Form'!I63,0)","v":0},{"$nulls":6},{"$f":"IF('Order Form'!B62=BuckleBreakdown!$J$8,+'Order Form'!I62,0)","v":0}]
[null,{"$f":"IF('Order Form'!B64=BuckleBreakdown!$B$7,+'Order Form'!I64,0)","v":0},{"$f":"IF('Order Form'!B64=BuckleBreakdown!$C$7,+'Order Form'!I64,0)","v":0},{"$nulls":6},{"$f":"IF('Order Form'!B63=BuckleBreakdown!$J$8,+'Order Form'!I63,0)","v":0}]
[null,{"$f":"IF('Order Form'!B65=BuckleBreakdown!$B$7,+'Order Form'!I65,0)","v":0},{"$f":"IF('Order Form'!B65=BuckleBreakdown!$C$7,+'Order Form'!I65,0)","v":0},{"$nulls":6},{"$f":"IF('Order Form'!B64=BuckleBreakdown!$J$8,+'Order Form'!I64,0)","v":0}]
[null,{"$f":"IF('Order Form'!B66=BuckleBreakdown!$B$7,+'Order Form'!I66,0)","v":0},{"$f":"IF('Order Form'!B66=BuckleBreakdown!$C$7,+'Order Form'!I66,0)","v":0},{"$nulls":6},{"$f":"IF('Order Form'!B65=BuckleBreakdown!$J$8,+'Order Form'!I65,0)","v":0}]
[null,{"$f":"IF('Order Form'!B67=BuckleBreakdown!$B$7,+'Order Form'!I67,0)","v":0},{"$f":"IF('Order Form'!B67=BuckleBreakdown!$C$7,+'Order Form'!I67,0)","v":0},{"$nulls":6},{"$f":"IF('Order Form'!B66=BuckleBreakdown!$J$8,+'Order Form'!I66,0)","v":0}]
[{"$nulls":9},{"$f":"IF('Order Form'!B67=BuckleBreakdown!$J$8,+'Order Form'!I67,0)","v":0}]
[{"$nulls":10},"QTY","Order Rate"]
[{"$nulls":10},{"$f":"SUM(J22:J31)","v":0},{"$f":"IF(K20<200,\"Less Than MOQ\",VLOOKUP(K20,BuckleData!$M:$N,2,FALSE))","v":"Less Than MOQ"}]
[null,null,"QTY","Order Rate",{"$nulls":5},"Polished Plate"]
[null,null,{"$f":"SUM(B24:B33)","v":0},{"$f":"IF(C22<50,\"Less Than MOQ\",VLOOKUP(C22,BuckleData!$J:$K,2,FALSE))","v":"Less Than MOQ"},{"$nulls":5},{"$f":"IF('Order Form'!B58=BuckleBreakdown!$J$21,+'Order Form'!I58,0)","v":0}]
[null,"Debossed",{"$nulls":7},{"$f":"IF('Order Form'!B59=BuckleBreakdown!$J$21,+'Order Form'!I59,0)","v":0}]
[null,{"$f":"IF('Order Form'!B58=BuckleBreakdown!$B$23,+'Order Form'!I58,0)","v":0},{"$nulls":7},{"$f":"IF('Order Form'!B60=BuckleBreakdown!$J$21,+'Order Form'!I60,0)","v":0}]
[null,{"$f":"IF('Order Form'!B59=BuckleBreakdown!$B$23,+'Order Form'!I59,0)","v":0},{"$nulls":7},{"$f":"IF('Order Form'!B61=BuckleBreakdown!$J$21,+'Order Form'!I61,0)","v":0}]
[null,{"$f":"IF('Order Form'!B60=BuckleBreakdown!$B$23,+'Order Form'!I60,0)","v":0},{"$nulls":7},{"$f":"IF('Order Form'!B62=BuckleBreakdown!$J$21,+'Order Form'!I62,0)","v":0}]
[null,{"$f":"IF('Order Form'!B61=BuckleBreakdown!$B$23,+'Order Form'!I61,0)","v":0},{"$nulls":7},{"$f":"IF('Order Form'!B63=BuckleBreakdown!$J$21,+'Order Form'!I63,0)","v":0}]
[null,{"$f":"IF('Order Form'!B62=BuckleBreakdown!$B$23,+'Order Form'!I62,0)","v":0},{"$nulls":7},{"$f":"IF('Order Form'!B64=BuckleBreakdown!$J$21,+'Order Form'!I64,0)","v":0}]
[null,{"$f":"IF('Order Form'!B63=BuckleBreakdown!$B$23,+'Order Form'!I63,0)","v":0},{"$nulls":7},{"$f":"IF('Order Form'!B65=BuckleBreakdown!$J$21,+'Order Form'!I65,0)","v":0}]
[null,{"$f":"IF('Order Form'!B64=BuckleBreakdown!$B$23,+'Order Form'!I64,0)","v":0},{"$nulls":7},{"$f":"IF('Order Form'!B66=BuckleBreakdown!$J$21,+'Order Form'!I66,0)","v":0}]
[null,{"$f":"IF('Order Form'!B65=BuckleBreakdown!$B$23,+'Order Form'!I65,0)","v":0},{"$nulls":7},{"$f":"IF('Order Form'!B67=BuckleBreakdown!$J$21,+'Order Form'!I67,0)","v":0}]
[null,{"$f":"IF('Order Form'!B66=BuckleBreakdown!$B$23,+'Order Form'!I66,0)","v":0}]
[null,{"$f":"IF('Order Form'!B67=BuckleBreakdown!$B$23,+'Order Form'!I67,0)","v":0}]

{"sheet":"Go-In! & Fast Eddie Package BD","index":9,"n_rows":54,"n_cols":17,"rows_kept":54,"hidden":true}
[]
[null,"Go-In!",{"$nulls":9},"Go-In!"]
[null,null,"QTY","Grandfather Price","Order Price Level","Order Price","Order Rate",{"$nulls":5},"QTY","Grandfather Price","Order Price Level","Order Price","Order Rate"]
[null,null,{"$f":"SUM(B7:C26)","v":0},{"$f":"IF(ISBLANK('Order Form'!$B$31),'Go-In! & Fast Eddie Data'!E8,VLOOKUP('Order Form'!$B$31,'Go-In! & Fast Eddie Data'!$D:$E,2,FALSE))","v":{"v":4,"d":"$4.00"}},{"$f":"IFERROR(VLOOKUP(C4,'Go-In! & Fast Eddie Data'!G:H,2,FALSE),\"#1\")","v":"#1"},{"$f":"VLOOKUP(E4,'Go-In! & Fast Eddie Data'!$D:$E,2,FALSE)","v":{"v":4,"d":"$4.00"}},{"$f":"MIN(D4,F4)","v":{"v":4,"d":"$4.00"}},{"$nulls":5},{"$f":"SUM(L7:L26)","v":0},{"$f":"IF(ISBLANK('Order Form'!$B$31),'Go-In! & Fast Eddie Data'!E8,VLOOKUP('Order Form'!$B$31,'Go-In! & Fast Eddie Data'!$D:$E,2,FALSE))","v":{"v":4,"d":"$4.00"}},{"$f":"IFERROR(VLOOKUP(M4,'Go-In! & Fast Eddie Data'!G:H,2,FALSE),\"#1\")","v":"#1"},{"$f":"VLOOKUP(O4,'Go-In! & Fast Eddie Data'!D:E,2,FALSE)","v":{"v":4,"d":"$4.00"}},{"$f":"MIN(N4,P4)","v":{"v":4,"d":"$4.00"}}]
[{"$nulls":4},{"$f":"VLOOKUP(E4,'Order Form'!F93:G98,2,FALSE)","v":1}]
[null,"Etched","ColorPrint",{"$nulls":8},"Polished Plate"]
[null,{"$f":"IF('Order Form'!B34='Go-In! & Fast Eddie Package BD'!$B$6,+'Order Form'!I34,0)","v":0},{"$f":"IF('Order Form'!B34='Go-In! & Fast Eddie Package BD'!$C$6,+'Order Form'!I34,0)","v":0},{"$nulls":8},{"$f":"IF('Order Form'!B34='Go-In! & Fast Eddie Package BD'!$L$6,+'Order Form'!I34,0)","v":0}]
[null,{"$f":"IF('Order Form'!B35='Go-In! & Fast Eddie Package BD'!$B$6,+'Order Form'!I35,0)","v":0},{"$f":"IF('Order Form'!B35='Go-In! & Fast Eddie Package BD'!$C$6,+'Order Form'!I35,0)","v":0},{"$nulls":8},{"$f":"IF('Order Form'!B35='Go-In! & Fast Eddie Package BD'!$L$6,+'Order Form'!I35,0)","v":0}]
[null,{"$f":"IF('Order Form'!B36='Go-In! & Fast Eddie Package BD'!$B$6,+'Order Form'!I36,0)","v":0},{"$f":"IF('Order Form'!B36='Go-In! & Fast Eddie Package BD'!$C$6,+'Order Form'!I36,0)","v":0},{"$nulls":8},{"$f":"IF('Order Form'!B36='Go-In! & Fast Eddie Package BD'!$L$6,+'Order Form'!I36,0)","v":0}]
[null,{"$f":"IF('Order Form'!B37='Go-In! & Fast Eddie Package BD'!$B$6,+'Order Form'!I37,0)","v":0},{"$f":"IF('Order Form'!B37='Go-In! & Fast Eddie Package BD'!$C$6,+'Order Form'!I37,0)","v":0},{"$nulls":8},{"$f":"IF('Order Form'!B37='Go-In! & Fast Eddie Package BD'!$L$6,+'Order Form'!I37,0)","v":0}]
[null,{"$f":"IF('Order Form'!B38='Go-In! & Fast Eddie Package BD'!$B$6,+'Order Form'!I38,0)","v":0},{"$f":"IF('Order Form'!B38='Go-In! & Fast Eddie Package BD'!$C$6,+'Order Form'!I38,0)","v":0},{"$nulls":8},{"$f":"IF('Order Form'!B38='Go-In! & Fast Eddie Package BD'!$L$6,+'Order Form'!I38,0)","v":0}]
[null,{"$f":"IF('Order Form'!B39='Go-In! & Fast Eddie Package BD'!$B$6,+'Order Form'!I39,0)","v":0},{"$f":"IF('Order Form'!B39='Go-In! & Fast Eddie Package BD'!$C$6,+'Order Form'!I39,0)","v":0},{"$nulls":8},{"$f":"IF('Order Form'!B39='Go-In! & Fast Eddie Package BD'!$L$6,+'Order Form'!I39,0)","v":0}]
[null,{"$f":"IF('Order Form'!B40='Go-In! & Fast Eddie Package BD'!$B$6,+'Order Form'!I40,0)","v":0},{"$f":"IF('Order Form'!B40='Go-In! & Fast Eddie Package BD'!$C$6,+'Order Form'!I40,0)","v":0},{"$nulls":8},{"$f":"IF('Order Form'!B40='Go-In! & Fast Eddie Package BD'!$L$6,+'Order Form'!I40,0)","v":0}]
[null,{"$f":"IF('Order Form'!B41='Go-In! & Fast Eddie Package BD'!$B$6,+'Order Form'!I41,0)","v":0},{"$f":"IF('Order Form'!B41='Go-In! & Fast Eddie Package BD'!$C$6,+'Order Form'!I41,0)","v":0},{"$nulls":8},{"$f":"IF('Order Form'!B41='Go-In! & Fast Eddie Package BD'!$L$6,+'Order Form'!I41,0)","v":0}]
[null,{"$f":"IF('Order Form'!B42='Go-In! & Fast Eddie Package BD'!$B$6,+'Order Form'!I42,0)","v":0},{"$f":"IF('Order Form'!B42='Go-In! & Fast Eddie Package BD'!$C$6,+'Order Form'!I42,0)","v":0},{"$nulls":8},{"$f":"IF('Order Form'!B42='Go-In! & Fast Eddie Package BD'!$L$6,+'Order Form'!I42,0)","v":0}]
[null,{"$f":"IF('Order Form'!B43='Go-In! & Fast Eddie Package BD'!$B$6,+'Order Form'!I43,0)","v":0},{"$f":"IF('Order Form'!B43='Go-In! & Fast Eddie Package BD'!$C$6,+'Order Form'!I43,0)","v":0},{"$nulls":8},{"$f":"IF('Order Form'!B43='Go-In! & Fast Eddie Package BD'!$L$6,+'Order Form'!I43,0)","v":0}]
[null,{"$f":"IF('Order Form'!B44='Go-In! & Fast Eddie Package BD'!$B$6,+'Order Form'!I44,0)","v":0},{"$f":"IF('Order Form'!B44='Go-In! & Fast Eddie Package BD'!$C$6,+'Order Form'!I44,0)","v":0},{"$nulls":8},{"$f":"IF('Order Form'!B44='Go-In! & Fast Eddie Package BD'!$L$6,+'Order Form'!I44,0)","v":0}]
[null,{"$f":"IF('Order Form'!B45='Go-In! & Fast Eddie Package BD'!$B$6,+'Order Form'!I45,0)","v":0},{"$f":"IF('Order Form'!B45='Go-In! & Fast Eddie Package BD'!$C$6,+'Order Form'!I45,0)","v":0},{"$nulls":8},{"$f":"IF('Order Form'!B45='Go-In! & Fast Eddie Package BD'!$L$6,+'Order Form'!I45,0)","v":0}]
[null,{"$f":"IF('Order Form'!B46='Go-In! & Fast Eddie Package BD'!$B$6,+'Order Form'!I46,0)","v":0},{"$f":"IF('Order Form'!B46='Go-In! & Fast Eddie Package BD'!$C$6,+'Order Form'!I46,0)","v":0},{"$nulls":8},{"$f":"IF('Order Form'!B46='Go-In! & Fast Eddie Package BD'!$L$6,+'Order Form'!I46,0)","v":0}]
[null,{"$f":"IF('Order Form'!B47='Go-In! & Fast Eddie Package BD'!$B$6,+'Order Form'!I47,0)","v":0},{"$f":"IF('Order Form'!B47='Go-In! & Fast Eddie Package BD'!$C$6,+'Order Form'!I47,0)","v":0},{"$nulls":8},{"$f":"IF('Order Form'!B47='Go-In! & Fast Eddie Package BD'!$L$6,+'Order Form'!I47,0)","v":0}]
[null,{"$f":"IF('Order Form'!B48='Go-In! & Fast Eddie Package BD'!$B$6,+'Order Form'!I48,0)","v":0},{"$f":"IF('Order Form'!B48='Go-In! & Fast Eddie Package BD'!$C$6,+'Order Form'!I48,0)","v":0},{"$nulls":8},{"$f":"IF('Order Form'!B48='Go-In! & Fast Eddie Package BD'!$L$6,+'Order Form'!I48,0)","v":0}]
[null,{"$f":"IF('Order Form'!B49='Go-In! & Fast Eddie Package BD'!$B$6,+'Order Form'!I49,0)","v":0},{"$f":"IF('Order Form'!B49='Go-In! & Fast Eddie Package BD'!$C$6,+'Order Form'!I49,0)","v":0},{"$nulls":8},{"$f":"IF('Order Form'!B49='Go-In! & Fast Eddie Package BD'!$L$6,+'Order Form'!I49,0)","v":0}]
[null,{"$f":"IF('Order Form'!B50='Go-In! & Fast Eddie Package BD'!$B$6,+'Order Form'!I50,0)","v":0},{"$f":"IF('Order Form'!B50='Go-In! & Fast Eddie Package BD'!$C$6,+'Order Form'!I50,0)","v":0},{"$nulls":8},{"$f":"IF('Order Form'!B50='Go-In! & Fast Eddie Package BD'!$L$6,+'Order Form'!I50,0)","v":0}]
[null,{"$f":"IF('Order Form'!B51='Go-In! & Fast Eddie Package BD'!$B$6,+'Order Form'!I51,0)","v":0},{"$f":"IF('Order Form'!B51='Go-In! & Fast Eddie Package BD'!$C$6,+'Order Form'!I51,0)","v":0},{"$nulls":8},{"$f":"IF('Order Form'!B51='Go-In! & Fast Eddie Package BD'!$L$6,+'Order Form'!I51,0)","v":0}]
[null,{"$f":"IF('Order Form'!B52='Go-In! & Fast Eddie Package BD'!$B$6,+'Order Form'!I52,0)","v":0},{"$f":"IF('Order Form'!B52='Go-In! & Fast Eddie Package BD'!$C$6,+'Order Form'!I52,0)","v":0},{"$nulls":8},{"$f":"IF('Order Form'!B52='Go-In! & Fast Eddie Package BD'!$L$6,+'Order Form'!I52,0)","v":0}]
[null,{"$f":"IF('Order Form'!B53='Go-In! & Fast Eddie Package BD'!$B$6,+'Order Form'!I53,0)","v":0},{"$f":"IF('Order Form'!B53='Go-In! & Fast Eddie Package BD'!$C$6,+'Order Form'!I53,0)","v":0},{"$nulls":8},{"$f":"IF('Order Form'!B53='Go-In! & Fast Eddie Package BD'!$L$6,+'Order Form'!I53,0)","v":0}]
[]
[]
[]
[null,"Fast Eddie"]
[null,null,"QTY","Grandfather Price","Order Price Level","Order Price","Order Rate"]
[null,null,{"$f":"SUM(B35:C54)","v":0},{"$f":"IF(ISBLANK('Order Form'!B31),'Go-In! & Fast Eddie Data'!M8,VLOOKUP('Order Form'!B31,'Go-In! & Fast Eddie Data'!L:M,2,FALSE))","v":{"v":6.5,"d":"$6.50"}},{"$f":"IFERROR(VLOOKUP(C32,'Go-In! & Fast Eddie Data'!G:H,2,FALSE),1)","v":1},{"$f":"VLOOKUP(E32,'Go-In! & Fast Eddie Data'!L:M,2,FALSE)","v":{"$error":"#N/A"}},{"$f":"MIN(D32,F32)","v":{"$error":"#N/A"}}]
[]
[null,"Etched","ColorPrint"]
[null,{"$f":"IF('Order Form'!B34='Go-In! & Fast Eddie Package BD'!$B$34,+'Order Form'!I34,0)","v":0},{"$f":"IF('Order Form'!B34='Go-In! & Fast Eddie Package BD'!$C$34,+'Order Form'!I34,0)","v":0}]
[null,{"$f":"IF('Order Form'!B35='Go-In! & Fast Eddie Package BD'!$B$34,+'Order Form'!I35,0)","v":0},{"$f":"IF('Order Form'!B35='Go-In! & Fast Eddie Package BD'!$C$34,+'Order Form'!I35,0)","v":0}]
[null,{"$f":"IF('Order Form'!B36='Go-In! & Fast Eddie Package BD'!$B$34,+'Order Form'!I36,0)","v":0},{"$f":"IF('Order Form'!B36='Go-In! & Fast Eddie Package BD'!$C$34,+'Order Form'!I36,0)","v":0}]
[null,{"$f":"IF('Order Form'!B37='Go-In! & Fast Eddie Package BD'!$B$34,+'Order Form'!I37,0)","v":0},{"$f":"IF('Order Form'!B37='Go-In! & Fast Eddie Package BD'!$C$34,+'Order Form'!I37,0)","v":0}]
[null,{"$f":"IF('Order Form'!B38='Go-In! & Fast Eddie Package BD'!$B$34,+'Order Form'!I38,0)","v":0},{"$f":"IF('Order Form'!B38='Go-In! & Fast Eddie Package BD'!$C$34,+'Order Form'!I38,0)","v":0}]
[null,{"$f":"IF('Order Form'!B39='Go-In! & Fast Eddie Package BD'!$B$34,+'Order Form'!I39,0)","v":0},{"$f":"IF('Order Form'!B39='Go-In! & Fast Eddie Package BD'!$C$34,+'Order Form'!I39,0)","v":0}]
[null,{"$f":"IF('Order Form'!B40='Go-In! & Fast Eddie Package BD'!$B$34,+'Order Form'!I40,0)","v":0},{"$f":"IF('Order Form'!B40='Go-In! & Fast Eddie Package BD'!$C$34,+'Order Form'!I40,0)","v":0}]
[null,{"$f":"IF('Order Form'!B41='Go-In! & Fast Eddie Package BD'!$B$34,+'Order Form'!I41,0)","v":0},{"$f":"IF('Order Form'!B41='Go-In! & Fast Eddie Package BD'!$C$34,+'Order Form'!I41,0)","v":0}]
[null,{"$f":"IF('Order Form'!B42='Go-In! & Fast Eddie Package BD'!$B$34,+'Order Form'!I42,0)","v":0},{"$f":"IF('Order Form'!B42='Go-In! & Fast Eddie Package BD'!$C$34,+'Order Form'!I42,0)","v":0}]
[null,{"$f":"IF('Order Form'!B43='Go-In! & Fast Eddie Package BD'!$B$34,+'Order Form'!I43,0)","v":0},{"$f":"IF('Order Form'!B43='Go-In! & Fast Eddie Package BD'!$C$34,+'Order Form'!I43,0)","v":0}]
[null,{"$f":"IF('Order Form'!B44='Go-In! & Fast Eddie Package BD'!$B$34,+'Order Form'!I44,0)","v":0},{"$f":"IF('Order Form'!B44='Go-In! & Fast Eddie Package BD'!$C$34,+'Order Form'!I44,0)","v":0}]
[null,{"$f":"IF('Order Form'!B45='Go-In! & Fast Eddie Package BD'!$B$34,+'Order Form'!I45,0)","v":0},{"$f":"IF('Order Form'!B45='Go-In! & Fast Eddie Package BD'!$C$34,+'Order Form'!I45,0)","v":0}]
[null,{"$f":"IF('Order Form'!B46='Go-In! & Fast Eddie Package BD'!$B$34,+'Order Form'!I46,0)","v":0},{"$f":"IF('Order Form'!B46='Go-In! & Fast Eddie Package BD'!$C$34,+'Order Form'!I46,0)","v":0}]
[null,{"$f":"IF('Order Form'!B47='Go-In! & Fast Eddie Package BD'!$B$34,+'Order Form'!I47,0)","v":0},{"$f":"IF('Order Form'!B47='Go-In! & Fast Eddie Package BD'!$C$34,+'Order Form'!I47,0)","v":0}]
[null,{"$f":"IF('Order Form'!B48='Go-In! & Fast Eddie Package BD'!$B$34,+'Order Form'!I48,0)","v":0},{"$f":"IF('Order Form'!B48='Go-In! & Fast Eddie Package BD'!$C$34,+'Order Form'!I48,0)","v":0}]
[null,{"$f":"IF('Order Form'!B49='Go-In! & Fast Eddie Package BD'!$B$34,+'Order Form'!I49,0)","v":0},{"$f":"IF('Order Form'!B49='Go-In! & Fast Eddie Package BD'!$C$34,+'Order Form'!I49,0)","v":0}]
[null,{"$f":"IF('Order Form'!B50='Go-In! & Fast Eddie Package BD'!$B$34,+'Order Form'!I50,0)","v":0},{"$f":"IF('Order Form'!B50='Go-In! & Fast Eddie Package BD'!$C$34,+'Order Form'!I50,0)","v":0}]
[null,{"$f":"IF('Order Form'!B51='Go-In! & Fast Eddie Package BD'!$B$34,+'Order Form'!I51,0)","v":0},{"$f":"IF('Order Form'!B51='Go-In! & Fast Eddie Package BD'!$C$34,+'Order Form'!I51,0)","v":0}]
[null,{"$f":"IF('Order Form'!B52='Go-In! & Fast Eddie Package BD'!$B$34,+'Order Form'!I52,0)","v":0},{"$f":"IF('Order Form'!B52='Go-In! & Fast Eddie Package BD'!$C$34,+'Order Form'!I52,0)","v":0}]
[null,{"$f":"IF('Order Form'!B53='Go-In! & Fast Eddie Package BD'!$B$34,+'Order Form'!I53,0)","v":0},{"$f":"IF('Order Form'!B53='Go-In! & Fast Eddie Package BD'!$C$34,+'Order Form'!I53,0)","v":0}]

{"sheet":"Go-In! & Fast Eddie Data","index":10,"n_rows":506,"n_cols":13,"rows_kept":506,"hidden":true}
[]
[]
[null,"Go-In!",{"$nulls":7},"Fast Eddie"]
[]
[{"$nulls":6},"Etched / Printed"]
[null,"Price Levels",null,"Price Sumamry",null,null,"Price Level",null,null,"Price Levels",null,"Price Summary"]
[]
[null,"#1",null,"#1",{"v":4,"d":"4.00"},null,1,"#1",null,"#1",null,"#1",6.5]
[null,"#2",null,"#2",{"v":3,"d":"3.00"},null,{"$f":"+G8+1","v":2},"#1",null,"#2",null,"#2",5.5]
[null,"#3",null,"#3",{"v":2,"d":"2.00"},null,{"$f":"+G9+1","v":3},"#1",null,"#3",null,"#3",4.5]
[null,"#4",null,"#4",{"v":1,"d":"1.00"},null,4,"#1",null,"#4",null,"#4",3.5]
[null,"#5",null,"#5",{"v":1,"d":"1.00"},null,5,"#1",null,"#5",null,"#5",3.5]
[null,"#6",null,"#6",{"v":1,"d":"1.00"},null,6,"#1",null,"#6",null,"#6",3.5]
[{"$nulls":6},7,"#1"]
[{"$nulls":6},8,"#1"]
[{"$nulls":6},9,"#1"]
[{"$nulls":6},10,"#1"]
[{"$nulls":6},11,"#1"]
[{"$nulls":6},12,"#1"]
[{"$nulls":6},13,"#1"]
[{"$nulls":6},14,"#1"]
[{"$nulls":6},15,"#1"]
[{"$nulls":6},16,"#1"]
[{"$nulls":6},17,"#1"]
[{"$nulls":6},18,"#1"]
[{"$nulls":6},19,"#1"]
[{"$nulls":6},20,"#1"]
[{"$nulls":6},21,"#1"]
[{"$nulls":6},22,"#1"]
[{"$nulls":6},23,"#1"]
[{"$nulls":6},24,"#2"]
[{"$nulls":6},25,"#2"]
[{"$nulls":6},26,"#2"]
[{"$nulls":6},27,"#2"]
[{"$nulls":6},28,"#2"]
[{"$nulls":6},29,"#2"]
[{"$nulls":6},30,"#2"]
[{"$nulls":6},31,"#2"]
[{"$nulls":6},32,"#2"]
[{"$nulls":6},33,"#2"]
[{"$nulls":6},34,"#2"]
[{"$nulls":6},35,"#2"]
[{"$nulls":6},36,"#2"]
[{"$nulls":6},37,"#2"]
[{"$nulls":6},38,"#2"]
[{"$nulls":6},39,"#2"]
[{"$nulls":6},40,"#2"]
[{"$nulls":6},41,"#2"]
[{"$nulls":6},42,"#2"]
[{"$nulls":6},43,"#2"]
[{"$nulls":6},44,"#2"]
[{"$nulls":6},45,"#2"]
[{"$nulls":6},46,"#2"]
[{"$nulls":6},47,"#2"]
[{"$nulls":6},48,"#2"]
[{"$nulls":6},49,"#2"]
[{"$nulls":6},50,"#2"]
[{"$nulls":6},51,"#2"]
[{"$nulls":6},52,"#2"]
[{"$nulls":6},53,"#2"]
[{"$nulls":6},54,"#2"]
[{"$nulls":6},55,"#2"]
[{"$nulls":6},56,"#2"]
[{"$nulls":6},57,"#2"]
[{"$nulls":6},58,"#2"]
[{"$nulls":6},59,"#2"]
[{"$nulls":6},60,"#2"]
[{"$nulls":6},61,"#2"]
[{"$nulls":6},62,"#2"]
[{"$nulls":6},63,"#2"]
[{"$nulls":6},64,"#2"]
[{"$nulls":6},65,"#2"]
[{"$nulls":6},66,"#2"]
[{"$nulls":6},{"$f":"+G73+1","v":67},"#2"]
[{"$nulls":6},68,"#2"]
[{"$nulls":6},69,"#2"]
[{"$nulls":6},70,"#2"]
[{"$nulls":6},71,"#2"]
[{"$nulls":6},72,"#2"]
[{"$nulls":6},73,"#2"]
[{"$nulls":6},74,"#2"]
[{"$nulls":6},75,"#2"]
[{"$nulls":6},76,"#2"]
[{"$nulls":6},77,"#2"]
[{"$nulls":6},78,"#2"]
[{"$nulls":6},79,"#2"]
[{"$nulls":6},80,"#2"]
[{"$nulls":6},81,"#2"]
[{"$nulls":6},82,"#2"]
[{"$nulls":6},83,"#2"]
[{"$nulls":6},84,"#2"]
[{"$nulls":6},85,"#2"]
[{"$nulls":6},86,"#2"]
[{"$nulls":6},87,"#2"]
[{"$nulls":6},88,"#2"]
[{"$nulls":6},89,"#2"]
[{"$nulls":6},90,"#2"]
[{"$nulls":6},91,"#2"]
[{"$nulls":6},92,"#2"]
[{"$nulls":6},93,"#2"]
[{"$nulls":6},94,"#2"]
[{"$nulls":6},95,"#2"]
[{"$nulls":6},96,"#2"]
[{"$nulls":6},97,"#2"]
[{"$nulls":6},98,"#2"]
[{"$nulls":6},99,"#2"]
[{"$nulls":6},100,"#3"]
[{"$nulls":6},101,"#3"]
[{"$nulls":6},102,"#3"]
[{"$nulls":6},103,"#3"]
[{"$nulls":6},104,"#3"]
[{"$nulls":6},105,"#3"]
[{"$nulls":6},106,"#3"]
[{"$nulls":6},107,"#3"]
[{"$nulls":6},108,"#3"]
[{"$nulls":6},109,"#3"]
[{"$nulls":6},110,"#3"]
[{"$nulls":6},111,"#3"]
[{"$nulls":6},112,"#3"]
[{"$nulls":6},113,"#3"]
[{"$nulls":6},114,"#3"]
[{"$nulls":6},115,"#3"]
[{"$nulls":6},116,"#3"]
[{"$nulls":6},117,"#3"]
[{"$nulls":6},118,"#3"]
[{"$nulls":6},119,"#3"]
[{"$nulls":6},120,"#3"]
[{"$nulls":6},121,"#3"]
[{"$nulls":6},122,"#3"]
[{"$nulls":6},123,"#3"]
[{"$nulls":6},124,"#3"]
[{"$nulls":6},125,"#3"]
[{"$nulls":6},126,"#3"]
[{"$nulls":6},127,"#3"]
[{"$nulls":6},128,"#3"]
[{"$nulls":6},129,"#3"]
[{"$nulls":6},130,"#3"]
[{"$nulls":6},{"$f":"+G137+1","v":131},"#3"]
[{"$nulls":6},132,"#3"]
[{"$nulls":6},133,"#3"]
[{"$nulls":6},134,"#3"]
[{"$nulls":6},135,"#3"]
[{"$nulls":6},136,"#3"]
[{"$nulls":6},137,"#3"]
[{"$nulls":6},138,"#3"]
[{"$nulls":6},139,"#3"]
[{"$nulls":6},140,"#3"]
[{"$nulls":6},141,"#3"]
[{"$nulls":6},142,"#3"]
[{"$nulls":6},143,"#3"]
[{"$nulls":6},144,"#3"]
[{"$nulls":6},145,"#3"]
[{"$nulls":6},146,"#3"]
[{"$nulls":6},147,"#3"]
[{"$nulls":6},148,"#3"]
[{"$nulls":6},149,"#3"]
[{"$nulls":6},150,"#3"]
[{"$nulls":6},151,"#3"]
[{"$nulls":6},152,"#3"]
[{"$nulls":6},153,"#3"]
[{"$nulls":6},154,"#3"]
[{"$nulls":6},155,"#3"]
[{"$nulls":6},156,"#3"]
[{"$nulls":6},157,"#3"]
[{"$nulls":6},158,"#3"]
[{"$nulls":6},159,"#3"]
[{"$nulls":6},160,"#3"]
[{"$nulls":6},161,"#3"]
[{"$nulls":6},162,"#3"]
[{"$nulls":6},163,"#3"]
[{"$nulls":6},164,"#3"]
[{"$nulls":6},165,"#3"]
[{"$nulls":6},166,"#3"]
[{"$nulls":6},167,"#3"]
[{"$nulls":6},168,"#3"]
[{"$nulls":6},169,"#3"]
[{"$nulls":6},170,"#3"]
[{"$nulls":6},171,"#3"]
[{"$nulls":6},172,"#3"]
[{"$nulls":6},173,"#3"]
[{"$nulls":6},174,"#3"]
[{"$nulls":6},175,"#3"]
[{"$nulls":6},176,"#3"]
[{"$nulls":6},177,"#3"]
[{"$nulls":6},178,"#3"]
[{"$nulls":6},179,"#3"]
[{"$nulls":6},180,"#3"]
[{"$nulls":6},181,"#3"]
[{"$nulls":6},182,"#3"]
[{"$nulls":6},183,"#3"]
[{"$nulls":6},184,"#3"]
[{"$nulls":6},185,"#3"]
[{"$nulls":6},186,"#3"]
[{"$nulls":6},187,"#3"]
[{"$nulls":6},188,"#3"]
[{"$nulls":6},189,"#3"]
[{"$nulls":6},190,"#3"]
[{"$nulls":6},191,"#3"]
[{"$nulls":6},192,"#3"]
[{"$nulls":6},193,"#3"]
[{"$nulls":6},194,"#3"]
[{"$nulls":6},{"$f":"+G201+1","v":195},"#3"]
[{"$nulls":6},196,"#3"]
[{"$nulls":6},197,"#3"]
[{"$nulls":6},198,"#3"]
[{"$nulls":6},199,"#3"]
[{"$nulls":6},200,"#4"]
[{"$nulls":6},201,"#4"]
[{"$nulls":6},202,"#4"]
[{"$nulls":6},203,"#4"]
[{"$nulls":6},204,"#4"]
[{"$nulls":6},205,"#4"]
[{"$nulls":6},206,"#4"]
[{"$nulls":6},207,"#4"]
[{"$nulls":6},208,"#4"]
[{"$nulls":6},209,"#4"]
[{"$nulls":6},210,"#4"]
[{"$nulls":6},211,"#4"]
[{"$nulls":6},212,"#4"]
[{"$nulls":6},213,"#4"]
[{"$nulls":6},214,"#4"]
[{"$nulls":6},215,"#4"]
[{"$nulls":6},216,"#4"]
[{"$nulls":6},217,"#4"]
[{"$nulls":6},218,"#4"]
[{"$nulls":6},219,"#4"]
[{"$nulls":6},220,"#4"]
[{"$nulls":6},221,"#4"]
[{"$nulls":6},222,"#4"]
[{"$nulls":6},223,"#4"]
[{"$nulls":6},224,"#4"]
[{"$nulls":6},225,"#4"]
[{"$nulls":6},226,"#4"]
[{"$nulls":6},227,"#4"]
[{"$nulls":6},228,"#4"]
[{"$nulls":6},229,"#4"]
[{"$nulls":6},230,"#4"]
[{"$nulls":6},231,"#4"]
[{"$nulls":6},232,"#4"]
[{"$nulls":6},233,"#4"]
[{"$nulls":6},234,"#4"]
[{"$nulls":6},235,"#4"]
[{"$nulls":6},236,"#4"]
[{"$nulls":6},237,"#4"]
[{"$nulls":6},238,"#4"]
[{"$nulls":6},239,"#4"]
[{"$nulls":6},240,"#4"]
[{"$nulls":6},241,"#4"]
[{"$nulls":6},242,"#4"]
[{"$nulls":6},243,"#4"]
[{"$nulls":6},244,"#4"]
[{"$nulls":6},245,"#4"]
[{"$nulls":6},246,"#4"]
[{"$nulls":6},247,"#4"]
[{"$nulls":6},248,"#4"]
[{"$nulls":6},249,"#4"]
[{"$nulls":6},250,"#5"]
[{"$nulls":6},251,"#5"]
[{"$nulls":6},252,"#5"]
[{"$nulls":6},253,"#5"]
[{"$nulls":6},254,"#5"]
[{"$nulls":6},255,"#5"]
[{"$nulls":6},256,"#5"]
[{"$nulls":6},257,"#5"]
[{"$nulls":6},258,"#5"]
[{"$nulls":6},{"$f":"+G265+1","v":259},"#5"]
[{"$nulls":6},260,"#5"]
[{"$nulls":6},261,"#5"]
[{"$nulls":6},262,"#5"]
[{"$nulls":6},263,"#5"]
[{"$nulls":6},264,"#5"]
[{"$nulls":6},265,"#5"]
[{"$nulls":6},266,"#5"]
[{"$nulls":6},267,"#5"]
[{"$nulls":6},268,"#5"]
[{"$nulls":6},269,"#5"]
[{"$nulls":6},270,"#5"]
[{"$nulls":6},271,"#5"]
[{"$nulls":6},272,"#5"]
[{"$nulls":6},273,"#5"]
[{"$nulls":6},274,"#5"]
[{"$nulls":6},275,"#5"]
[{"$nulls":6},276,"#5"]
[{"$nulls":6},277,"#5"]
[{"$nulls":6},278,"#5"]
[{"$nulls":6},279,"#5"]
[{"$nulls":6},280,"#5"]
[{"$nulls":6},281,"#5"]
[{"$nulls":6},282,"#5"]
[{"$nulls":6},283,"#5"]
[{"$nulls":6},284,"#5"]
[{"$nulls":6},285,"#5"]
[{"$nulls":6},286,"#5"]
[{"$nulls":6},287,"#5"]
[{"$nulls":6},288,"#5"]
[{"$nulls":6},289,"#5"]
[{"$nulls":6},290,"#5"]
[{"$nulls":6},291,"#5"]
[{"$nulls":6},292,"#5"]
[{"$nulls":6},293,"#5"]
[{"$nulls":6},294,"#5"]
[{"$nulls":6},295,"#5"]
[{"$nulls":6},296,"#5"]
[{"$nulls":6},297,"#5"]
[{"$nulls":6},298,"#5"]
[{"$nulls":6},299,"#5"]
[{"$nulls":6},300,"#5"]
[{"$nulls":6},301,"#5"]
[{"$nulls":6},302,"#5"]
[{"$nulls":6},303,"#5"]
[{"$nulls":6},304,"#5"]
[{"$nulls":6},305,"#5"]
[{"$nulls":6},306,"#5"]
[{"$nulls":6},307,"#5"]
[{"$nulls":6},308,"#5"]
[{"$nulls":6},309,"#5"]
[{"$nulls":6},310,"#5"]
[{"$nulls":6},311,"#5"]
[{"$nulls":6},312,"#5"]
[{"$nulls":6},313,"#5"]
[{"$nulls":6},314,"#5"]
[{"$nulls":6},315,"#5"]
[{"$nulls":6},316,"#5"]
[{"$nulls":6},317,"#5"]
[{"$nulls":6},318,"#5"]
[{"$nulls":6},319,"#5"]
[{"$nulls":6},320,"#5"]
[{"$nulls":6},321,"#5"]
[{"$nulls":6},322,"#5"]
[{"$nulls":6},{"$f":"+G329+1","v":323},"#5"]
[{"$nulls":6},324,"#5"]
[{"$nulls":6},325,"#5"]
[{"$nulls":6},326,"#5"]
[{"$nulls":6},327,"#5"]
[{"$nulls":6},328,"#5"]
[{"$nulls":6},329,"#5"]
[{"$nulls":6},330,"#5"]
[{"$nulls":6},331,"#5"]
[{"$nulls":6},332,"#5"]
[{"$nulls":6},333,"#5"]
[{"$nulls":6},334,"#5"]
[{"$nulls":6},335,"#5"]
[{"$nulls":6},336,"#5"]
[{"$nulls":6},337,"#5"]
[{"$nulls":6},338,"#5"]
[{"$nulls":6},339,"#5"]
[{"$nulls":6},340,"#5"]
[{"$nulls":6},341,"#5"]
[{"$nulls":6},342,"#5"]
[{"$nulls":6},343,"#5"]
[{"$nulls":6},344,"#5"]
[{"$nulls":6},345,"#5"]
[{"$nulls":6},346,"#5"]
[{"$nulls":6},347,"#5"]
[{"$nulls":6},348,"#5"]
[{"$nulls":6},349,"#5"]
[{"$nulls":6},350,"#6"]
[{"$nulls":6},351,"#6"]
[{"$nulls":6},352,"#6"]
[{"$nulls":6},353,"#6"]
[{"$nulls":6},354,"#6"]
[{"$nulls":6},355,"#6"]
[{"$nulls":6},356,"#6"]
[{"$nulls":6},357,"#6"]
[{"$nulls":6},358,"#6"]
[{"$nulls":6},359,"#6"]
[{"$nulls":6},360,"#6"]
[{"$nulls":6},361,"#6"]
[{"$nulls":6},362,"#6"]
[{"$nulls":6},363,"#6"]
[{"$nulls":6},364,"#6"]
[{"$nulls":6},365,"#6"]
[{"$nulls":6},366,"#6"]
[{"$nulls":6},367,"#6"]
[{"$nulls":6},368,"#6"]
[{"$nulls":6},369,"#6"]
[{"$nulls":6},370,"#6"]
[{"$nulls":6},371,"#6"]
[{"$nulls":6},372,"#6"]
[{"$nulls":6},373,"#6"]
[{"$nulls":6},374,"#6"]
[{"$nulls":6},375,"#6"]
[{"$nulls":6},376,"#6"]
[{"$nulls":6},377,"#6"]
[{"$nulls":6},378,"#6"]
[{"$nulls":6},379,"#6"]
[{"$nulls":6},380,"#6"]
[{"$nulls":6},381,"#6"]
[{"$nulls":6},382,"#6"]
[{"$nulls":6},383,"#6"]
[{"$nulls":6},384,"#6"]
[{"$nulls":6},385,"#6"]
[{"$nulls":6},386,"#6"]
[{"$nulls":6},{"$f":"+G393+1","v":387},"#6"]
[{"$nulls":6},388,"#6"]
[{"$nulls":6},389,"#6"]
[{"$nulls":6},390,"#6"]
[{"$nulls":6},391,"#6"]
[{"$nulls":6},392,"#6"]
[{"$nulls":6},393,"#6"]
[{"$nulls":6},394,"#6"]
[{"$nulls":6},395,"#6"]
[{"$nulls":6},396,"#6"]
[{"$nulls":6},397,"#6"]
[{"$nulls":6},398,"#6"]
[{"$nulls":6},399,"#6"]
[{"$nulls":6},400,"#6"]
[{"$nulls":6},401,"#6"]
[{"$nulls":6},402,"#6"]
[{"$nulls":6},403,"#6"]
[{"$nulls":6},404,"#6"]
[{"$nulls":6},405,"#6"]
[{"$nulls":6},406,"#6"]
[{"$nulls":6},407,"#6"]
[{"$nulls":6},408,"#6"]
[{"$nulls":6},409,"#6"]
[{"$nulls":6},410,"#6"]
[{"$nulls":6},411,"#6"]
[{"$nulls":6},412,"#6"]
[{"$nulls":6},413,"#6"]
[{"$nulls":6},414,"#6"]
[{"$nulls":6},415,"#6"]
[{"$nulls":6},416,"#6"]
[{"$nulls":6},417,"#6"]
[{"$nulls":6},418,"#6"]
[{"$nulls":6},419,"#6"]
[{"$nulls":6},420,"#6"]
[{"$nulls":6},421,"#6"]
[{"$nulls":6},422,"#6"]
[{"$nulls":6},423,"#6"]
[{"$nulls":6},424,"#6"]
[{"$nulls":6},425,"#6"]
[{"$nulls":6},426,"#6"]
[{"$nulls":6},427,"#6"]
[{"$nulls":6},428,"#6"]
[{"$nulls":6},429,"#6"]
[{"$nulls":6},430,"#6"]
[{"$nulls":6},431,"#6"]
[{"$nulls":6},432,"#6"]
[{"$nulls":6},433,"#6"]
[{"$nulls":6},434,"#6"]
[{"$nulls":6},435,"#6"]
[{"$nulls":6},436,"#6"]
[{"$nulls":6},437,"#6"]
[{"$nulls":6},438,"#6"]
[{"$nulls":6},439,"#6"]
[{"$nulls":6},440,"#6"]
[{"$nulls":6},441,"#6"]
[{"$nulls":6},442,"#6"]
[{"$nulls":6},443,"#6"]
[{"$nulls":6},444,"#6"]
[{"$nulls":6},445,"#6"]
[{"$nulls":6},446,"#6"]
[{"$nulls":6},447,"#6"]
[{"$nulls":6},448,"#6"]
[{"$nulls":6},449,"#6"]
[{"$nulls":6},450,"#6"]
[{"$nulls":6},{"$f":"+G457+1","v":451},"#6"]
[{"$nulls":6},452,"#6"]
[{"$nulls":6},453,"#6"]
[{"$nulls":6},454,"#6"]
[{"$nulls":6},455,"#6"]
[{"$nulls":6},456,"#6"]
[{"$nulls":6},457,"#6"]
[{"$nulls":6},458,"#6"]
[{"$nulls":6},459,"#6"]
[{"$nulls":6},460,"#6"]
[{"$nulls":6},461,"#6"]
[{"$nulls":6},462,"#6"]
[{"$nulls":6},463,"#6"]
[{"$nulls":6},464,"#6"]
[{"$nulls":6},465,"#6"]
[{"$nulls":6},466,"#6"]
[{"$nulls":6},467,"#6"]
[{"$nulls":6},468,"#6"]
[{"$nulls":6},469,"#6"]
[{"$nulls":6},470,"#6"]
[{"$nulls":6},471,"#6"]
[{"$nulls":6},472,"#6"]
[{"$nulls":6},473,"#6"]
[{"$nulls":6},474,"#6"]
[{"$nulls":6},475,"#6"]
[{"$nulls":6},476,"#6"]
[{"$nulls":6},477,"#6"]
[{"$nulls":6},478,"#6"]
[{"$nulls":6},479,"#6"]
[{"$nulls":6},480,"#6"]
[{"$nulls":6},481,"#6"]
[{"$nulls":6},482,"#6"]
[{"$nulls":6},483,"#6"]
[{"$nulls":6},484,"#6"]
[{"$nulls":6},485,"#6"]
[{"$nulls":6},486,"#6"]
[{"$nulls":6},487,"#6"]
[{"$nulls":6},488,"#6"]
[{"$nulls":6},489,"#6"]
[{"$nulls":6},490,"#6"]
[{"$nulls":6},491,"#6"]
[{"$nulls":6},492,"#6"]
[{"$nulls":6},493,"#6"]
[{"$nulls":6},494,"#6"]
[{"$nulls":6},495,"#6"]
[{"$nulls":6},496,"#6"]
[{"$nulls":6},497,"#6"]
[{"$nulls":6},498,"#6"]
[{"$nulls":6},499,"#6"]

{"sheet":"Go-In! & Fast Eddie Buckle BD","index":11,"n_rows":42,"n_cols":17,"rows_kept":42,"hidden":true}
[]
[null,"Go-In!",{"$nulls":9},"Go-In!"]
[null,null,"QTY","Grandfather Price","Order Price Level","Order Price","Order Rate",{"$nulls":5},"QTY","Grandfather Price","Order Price Level","Order Price","Order Rate"]
[null,null,{"$f":"SUM(B7:C16)","v":0},{"$f":"IF(ISBLANK('Order Form'!$B$31),'Go-In! & Fast Eddie Buckle Data'!E8,VLOOKUP('Order Form'!$B$31,'Go-In! & Fast Eddie Buckle Data'!$D:$E,2,FALSE))","v":{"v":4,"d":"$4.00"}},{"$f":"IFERROR(VLOOKUP(C4,'Go-In! & Fast Eddie Buckle Data'!G:H,2,FALSE),\"#1\")","v":"#1"},{"$f":"VLOOKUP(E4,'Go-In! & Fast Eddie Buckle Data'!D:E,2,FALSE)","v":{"v":4,"d":"$4.00"}},{"$f":"MIN(D4,F4)","v":{"v":4,"d":"$4.00"}},{"$nulls":5},{"$f":"SUM(L7:L16)","v":0},{"$f":"IF(ISBLANK('Order Form'!$B$31),'Go-In! & Fast Eddie Buckle Data'!E8,VLOOKUP('Order Form'!$B$31,'Go-In! & Fast Eddie Buckle Data'!$D:$E,2,FALSE))","v":{"v":4,"d":"$4.00"}},{"$f":"IFERROR(VLOOKUP(M4,'Go-In! & Fast Eddie Buckle Data'!G:H,2,FALSE),\"#1\")","v":"#1"},{"$f":"VLOOKUP(O4,'Go-In! & Fast Eddie Buckle Data'!D:E,2,FALSE)","v":{"v":4,"d":"$4.00"}},{"$f":"MIN(N4,P4)","v":{"v":4,"d":"$4.00"}}]
[{"$nulls":4},{"$f":"VLOOKUP(E4,'Order Form'!F93:G98,2,FALSE)","v":1}]
[null,"Etched","ColorPrint",{"$nulls":8},"Polished Plate"]
[null,{"$f":"IF('Order Form'!B58=$B$6,+'Order Form'!I58,0)","v":0},{"$f":"IF('Order Form'!B58=$C$6,+'Order Form'!I58,0)","v":0},{"$nulls":8},{"$f":"IF('Order Form'!B58=$L$6,+'Order Form'!I58,0)","v":0}]
[null,{"$f":"IF('Order Form'!B59=$B$6,+'Order Form'!I59,0)","v":0},{"$f":"IF('Order Form'!B59=$C$6,+'Order Form'!I59,0)","v":0},{"$nulls":8},{"$f":"IF('Order Form'!B59=$L$6,+'Order Form'!I59,0)","v":0}]
[null,{"$f":"IF('Order Form'!B60=$B$6,+'Order Form'!I60,0)","v":0},{"$f":"IF('Order Form'!B60=$C$6,+'Order Form'!I60,0)","v":0},{"$nulls":8},{"$f":"IF('Order Form'!B60=$L$6,+'Order Form'!I60,0)","v":0}]
[null,{"$f":"IF('Order Form'!B61=$B$6,+'Order Form'!I61,0)","v":0},{"$f":"IF('Order Form'!B61=$C$6,+'Order Form'!I61,0)","v":0},{"$nulls":8},{"$f":"IF('Order Form'!B61=$L$6,+'Order Form'!I61,0)","v":0}]
[null,{"$f":"IF('Order Form'!B62=$B$6,+'Order Form'!I62,0)","v":0},{"$f":"IF('Order Form'!B62=$C$6,+'Order Form'!I62,0)","v":0},{"$nulls":8},{"$f":"IF('Order Form'!B62=$L$6,+'Order Form'!I62,0)","v":0}]
[null,{"$f":"IF('Order Form'!B63=$B$6,+'Order Form'!I63,0)","v":0},{"$f":"IF('Order Form'!B63=$C$6,+'Order Form'!I63,0)","v":0},{"$nulls":8},{"$f":"IF('Order Form'!B63=$L$6,+'Order Form'!I63,0)","v":0}]
[null,{"$f":"IF('Order Form'!B64=$B$6,+'Order Form'!I64,0)","v":0},{"$f":"IF('Order Form'!B64=$C$6,+'Order Form'!I64,0)","v":0},{"$nulls":8},{"$f":"IF('Order Form'!B64=$L$6,+'Order Form'!I64,0)","v":0}]
[null,{"$f":"IF('Order Form'!B65=$B$6,+'Order Form'!I65,0)","v":0},{"$f":"IF('Order Form'!B65=$C$6,+'Order Form'!I65,0)","v":0},{"$nulls":8},{"$f":"IF('Order Form'!B65=$L$6,+'Order Form'!I65,0)","v":0}]
[null,{"$f":"IF('Order Form'!B66=$B$6,+'Order Form'!I66,0)","v":0},{"$f":"IF('Order Form'!B66=$C$6,+'Order Form'!I66,0)","v":0},{"$nulls":8},{"$f":"IF('Order Form'!B66=$L$6,+'Order Form'!I66,0)","v":0}]
[null,{"$f":"IF('Order Form'!B67=$B$6,+'Order Form'!I67,0)","v":0},{"$f":"IF('Order Form'!B67=$C$6,+'Order Form'!I67,0)","v":0},{"$nulls":8},{"$f":"IF('Order Form'!B67=$L$6,+'Order Form'!I67,0)","v":0}]
{"$rows_empty":11}
[null,"Fast Eddie"]
[null,null,"QTY","Grandfather Price","Order Price Level","Order Price","Order Rate"]
[null,null,{"$f":"SUM(B33:C42)","v":0},{"$f":"IF(ISBLANK('Order Form'!$B$31),'Go-In! & Fast Eddie Buckle Data'!M8,VLOOKUP('Order Form'!$B$31,'Go-In! & Fast Eddie Buckle Data'!$L:$M,2,FALSE))","v":{"v":6.5,"d":"$6.50"}},{"$f":"IFERROR(VLOOKUP(C30,'Go-In! & Fast Eddie Buckle Data'!G:H,2,FALSE),1)","v":1},{"$f":"VLOOKUP(E30,'Go-In! & Fast Eddie Buckle Data'!L:M,2,FALSE)","v":{"$error":"#N/A"}},{"$f":"MIN(D30,F30)","v":{"$error":"#N/A"}}]
[]
[null,"Etched","ColorPrint"]
[null,{"$f":"IF('Order Form'!B58=$B$32,+'Order Form'!I58,0)","v":0},{"$f":"IF('Order Form'!B58=$C$32,+'Order Form'!I58,0)","v":0}]
[null,{"$f":"IF('Order Form'!B59=$B$32,+'Order Form'!I59,0)","v":0},{"$f":"IF('Order Form'!B59=$C$32,+'Order Form'!I59,0)","v":0}]
[null,{"$f":"IF('Order Form'!B60=$B$32,+'Order Form'!I60,0)","v":0},{"$f":"IF('Order Form'!B60=$C$32,+'Order Form'!I60,0)","v":0}]
[null,{"$f":"IF('Order Form'!B61=$B$32,+'Order Form'!I61,0)","v":0},{"$f":"IF('Order Form'!B61=$C$32,+'Order Form'!I61,0)","v":0}]
[null,{"$f":"IF('Order Form'!B62=$B$32,+'Order Form'!I62,0)","v":0},{"$f":"IF('Order Form'!B62=$C$32,+'Order Form'!I62,0)","v":0}]
[null,{"$f":"IF('Order Form'!B63=$B$32,+'Order Form'!I63,0)","v":0},{"$f":"IF('Order Form'!B63=$C$32,+'Order Form'!I63,0)","v":0}]
[null,{"$f":"IF('Order Form'!B64=$B$32,+'Order Form'!I64,0)","v":0},{"$f":"IF('Order Form'!B64=$C$32,+'Order Form'!I64,0)","v":0}]
[null,{"$f":"IF('Order Form'!B65=$B$32,+'Order Form'!I65,0)","v":0},{"$f":"IF('Order Form'!B65=$C$32,+'Order Form'!I65,0)","v":0}]
[null,{"$f":"IF('Order Form'!B66=$B$32,+'Order Form'!I66,0)","v":0},{"$f":"IF('Order Form'!B66=$C$32,+'Order Form'!I66,0)","v":0}]
[null,{"$f":"IF('Order Form'!B67=$B$32,+'Order Form'!I67,0)","v":0},{"$f":"IF('Order Form'!B67=$C$32,+'Order Form'!I67,0)","v":0}]

{"sheet":"Go-In! & Fast Eddie Buckle Data","index":12,"n_rows":506,"n_cols":13,"rows_kept":506,"hidden":true}
[]
[]
[null,"Go-In!",{"$nulls":7},"Fast Eddie"]
[]
[{"$nulls":6},"Etched / Printed"]
[null,"Price Levels",null,"Price Sumamry",null,null,"Price Level",null,null,"Price Levels",null,"Price Summary"]
[]
[null,"#1",null,"#1",{"v":4,"d":"4.00"},null,1,"#1",null,"#1",null,"#1",6.5]
[null,"#2",null,"#2",{"v":3,"d":"3.00"},null,{"$f":"+G8+1","v":2},"#1",null,"#2",null,"#2",5.5]
[null,"#3",null,"#3",{"v":2,"d":"2.00"},null,{"$f":"+G9+1","v":3},"#1",null,"#3",null,"#3",4.5]
[null,"#4",null,"#4",{"v":1,"d":"1.00"},null,4,"#1",null,"#4",null,"#4",3.5]
[null,"#5",null,"#5",{"v":1,"d":"1.00"},null,5,"#1",null,"#5",null,"#5",3.5]
[null,"#6",null,"#6",{"v":1,"d":"1.00"},null,6,"#1",null,"#6",null,"#6",3.5]
[{"$nulls":6},7,"#1"]
[{"$nulls":6},8,"#1"]
[{"$nulls":6},9,"#1"]
[{"$nulls":6},10,"#1"]
[{"$nulls":6},11,"#1"]
[{"$nulls":6},12,"#1"]
[{"$nulls":6},13,"#1"]
[{"$nulls":6},14,"#1"]
[{"$nulls":6},15,"#1"]
[{"$nulls":6},16,"#1"]
[{"$nulls":6},17,"#1"]
[{"$nulls":6},18,"#1"]
[{"$nulls":6},19,"#1"]
[{"$nulls":6},20,"#1"]
[{"$nulls":6},21,"#1"]
[{"$nulls":6},22,"#1"]
[{"$nulls":6},23,"#1"]
[{"$nulls":6},24,"#2"]
[{"$nulls":6},25,"#2"]
[{"$nulls":6},26,"#2"]
[{"$nulls":6},27,"#2"]
[{"$nulls":6},28,"#2"]
[{"$nulls":6},29,"#2"]
[{"$nulls":6},30,"#2"]
[{"$nulls":6},31,"#2"]
[{"$nulls":6},32,"#2"]
[{"$nulls":6},33,"#2"]
[{"$nulls":6},34,"#2"]
[{"$nulls":6},35,"#2"]
[{"$nulls":6},36,"#2"]
[{"$nulls":6},37,"#2"]
[{"$nulls":6},38,"#2"]
[{"$nulls":6},39,"#2"]
[{"$nulls":6},40,"#2"]
[{"$nulls":6},41,"#2"]
[{"$nulls":6},42,"#2"]
[{"$nulls":6},43,"#2"]
[{"$nulls":6},44,"#2"]
[{"$nulls":6},45,"#2"]
[{"$nulls":6},46,"#2"]
[{"$nulls":6},47,"#2"]
[{"$nulls":6},48,"#2"]
[{"$nulls":6},49,"#2"]
[{"$nulls":6},50,"#2"]
[{"$nulls":6},51,"#2"]
[{"$nulls":6},52,"#2"]
[{"$nulls":6},53,"#2"]
[{"$nulls":6},54,"#2"]
[{"$nulls":6},55,"#2"]
[{"$nulls":6},56,"#2"]
[{"$nulls":6},57,"#2"]
[{"$nulls":6},58,"#2"]
[{"$nulls":6},59,"#2"]
[{"$nulls":6},60,"#2"]
[{"$nulls":6},61,"#2"]
[{"$nulls":6},62,"#2"]
[{"$nulls":6},63,"#2"]
[{"$nulls":6},64,"#2"]
[{"$nulls":6},65,"#2"]
[{"$nulls":6},66,"#2"]
[{"$nulls":6},{"$f":"+G73+1","v":67},"#2"]
[{"$nulls":6},68,"#2"]
[{"$nulls":6},69,"#2"]
[{"$nulls":6},70,"#2"]
[{"$nulls":6},71,"#2"]
[{"$nulls":6},72,"#2"]
[{"$nulls":6},73,"#2"]
[{"$nulls":6},74,"#2"]
[{"$nulls":6},75,"#2"]
[{"$nulls":6},76,"#2"]
[{"$nulls":6},77,"#2"]
[{"$nulls":6},78,"#2"]
[{"$nulls":6},79,"#2"]
[{"$nulls":6},80,"#2"]
[{"$nulls":6},81,"#2"]
[{"$nulls":6},82,"#2"]
[{"$nulls":6},83,"#2"]
[{"$nulls":6},84,"#2"]
[{"$nulls":6},85,"#2"]
[{"$nulls":6},86,"#2"]
[{"$nulls":6},87,"#2"]
[{"$nulls":6},88,"#2"]
[{"$nulls":6},89,"#2"]
[{"$nulls":6},90,"#2"]
[{"$nulls":6},91,"#2"]
[{"$nulls":6},92,"#2"]
[{"$nulls":6},93,"#2"]
[{"$nulls":6},94,"#2"]
[{"$nulls":6},95,"#2"]
[{"$nulls":6},96,"#2"]
[{"$nulls":6},97,"#2"]
[{"$nulls":6},98,"#2"]
[{"$nulls":6},99,"#2"]
[{"$nulls":6},100,"#3"]
[{"$nulls":6},101,"#3"]
[{"$nulls":6},102,"#3"]
[{"$nulls":6},103,"#3"]
[{"$nulls":6},104,"#3"]
[{"$nulls":6},105,"#3"]
[{"$nulls":6},106,"#3"]
[{"$nulls":6},107,"#3"]
[{"$nulls":6},108,"#3"]
[{"$nulls":6},109,"#3"]
[{"$nulls":6},110,"#3"]
[{"$nulls":6},111,"#3"]
[{"$nulls":6},112,"#3"]
[{"$nulls":6},113,"#3"]
[{"$nulls":6},114,"#3"]
[{"$nulls":6},115,"#3"]
[{"$nulls":6},116,"#3"]
[{"$nulls":6},117,"#3"]
[{"$nulls":6},118,"#3"]
[{"$nulls":6},119,"#3"]
[{"$nulls":6},120,"#3"]
[{"$nulls":6},121,"#3"]
[{"$nulls":6},122,"#3"]
[{"$nulls":6},123,"#3"]
[{"$nulls":6},124,"#3"]
[{"$nulls":6},125,"#3"]
[{"$nulls":6},126,"#3"]
[{"$nulls":6},127,"#3"]
[{"$nulls":6},128,"#3"]
[{"$nulls":6},129,"#3"]
[{"$nulls":6},130,"#3"]
[{"$nulls":6},{"$f":"+G137+1","v":131},"#3"]
[{"$nulls":6},132,"#3"]
[{"$nulls":6},133,"#3"]
[{"$nulls":6},134,"#3"]
[{"$nulls":6},135,"#3"]
[{"$nulls":6},136,"#3"]
[{"$nulls":6},137,"#3"]
[{"$nulls":6},138,"#3"]
[{"$nulls":6},139,"#3"]
[{"$nulls":6},140,"#3"]
[{"$nulls":6},141,"#3"]
[{"$nulls":6},142,"#3"]
[{"$nulls":6},143,"#3"]
[{"$nulls":6},144,"#3"]
[{"$nulls":6},145,"#3"]
[{"$nulls":6},146,"#3"]
[{"$nulls":6},147,"#3"]
[{"$nulls":6},148,"#3"]
[{"$nulls":6},149,"#3"]
[{"$nulls":6},150,"#3"]
[{"$nulls":6},151,"#3"]
[{"$nulls":6},152,"#3"]
[{"$nulls":6},153,"#3"]
[{"$nulls":6},154,"#3"]
[{"$nulls":6},155,"#3"]
[{"$nulls":6},156,"#3"]
[{"$nulls":6},157,"#3"]
[{"$nulls":6},158,"#3"]
[{"$nulls":6},159,"#3"]
[{"$nulls":6},160,"#3"]
[{"$nulls":6},161,"#3"]
[{"$nulls":6},162,"#3"]
[{"$nulls":6},163,"#3"]
[{"$nulls":6},164,"#3"]
[{"$nulls":6},165,"#3"]
[{"$nulls":6},166,"#3"]
[{"$nulls":6},167,"#3"]
[{"$nulls":6},168,"#3"]
[{"$nulls":6},169,"#3"]
[{"$nulls":6},170,"#3"]
[{"$nulls":6},171,"#3"]
[{"$nulls":6},172,"#3"]
[{"$nulls":6},173,"#3"]
[{"$nulls":6},174,"#3"]
[{"$nulls":6},175,"#3"]
[{"$nulls":6},176,"#3"]
[{"$nulls":6},177,"#3"]
[{"$nulls":6},178,"#3"]
[{"$nulls":6},179,"#3"]
[{"$nulls":6},180,"#3"]
[{"$nulls":6},181,"#3"]
[{"$nulls":6},182,"#3"]
[{"$nulls":6},183,"#3"]
[{"$nulls":6},184,"#3"]
[{"$nulls":6},185,"#3"]
[{"$nulls":6},186,"#3"]
[{"$nulls":6},187,"#3"]
[{"$nulls":6},188,"#3"]
[{"$nulls":6},189,"#3"]
[{"$nulls":6},190,"#3"]
[{"$nulls":6},191,"#3"]
[{"$nulls":6},192,"#3"]
[{"$nulls":6},193,"#3"]
[{"$nulls":6},194,"#3"]
[{"$nulls":6},{"$f":"+G201+1","v":195},"#3"]
[{"$nulls":6},196,"#3"]
[{"$nulls":6},197,"#3"]
[{"$nulls":6},198,"#3"]
[{"$nulls":6},199,"#3"]
[{"$nulls":6},200,"#4"]
[{"$nulls":6},201,"#4"]
[{"$nulls":6},202,"#4"]
[{"$nulls":6},203,"#4"]
[{"$nulls":6},204,"#4"]
[{"$nulls":6},205,"#4"]
[{"$nulls":6},206,"#4"]
[{"$nulls":6},207,"#4"]
[{"$nulls":6},208,"#4"]
[{"$nulls":6},209,"#4"]
[{"$nulls":6},210,"#4"]
[{"$nulls":6},211,"#4"]
[{"$nulls":6},212,"#4"]
[{"$nulls":6},213,"#4"]
[{"$nulls":6},214,"#4"]
[{"$nulls":6},215,"#4"]
[{"$nulls":6},216,"#4"]
[{"$nulls":6},217,"#4"]
[{"$nulls":6},218,"#4"]
[{"$nulls":6},219,"#4"]
[{"$nulls":6},220,"#4"]
[{"$nulls":6},221,"#4"]
[{"$nulls":6},222,"#4"]
[{"$nulls":6},223,"#4"]
[{"$nulls":6},224,"#4"]
[{"$nulls":6},225,"#4"]
[{"$nulls":6},226,"#4"]
[{"$nulls":6},227,"#4"]
[{"$nulls":6},228,"#4"]
[{"$nulls":6},229,"#4"]
[{"$nulls":6},230,"#4"]
[{"$nulls":6},231,"#4"]
[{"$nulls":6},232,"#4"]
[{"$nulls":6},233,"#4"]
[{"$nulls":6},234,"#4"]
[{"$nulls":6},235,"#4"]
[{"$nulls":6},236,"#4"]
[{"$nulls":6},237,"#4"]
[{"$nulls":6},238,"#4"]
[{"$nulls":6},239,"#4"]
[{"$nulls":6},240,"#4"]
[{"$nulls":6},241,"#4"]
[{"$nulls":6},242,"#4"]
[{"$nulls":6},243,"#4"]
[{"$nulls":6},244,"#4"]
[{"$nulls":6},245,"#4"]
[{"$nulls":6},246,"#4"]
[{"$nulls":6},247,"#4"]
[{"$nulls":6},248,"#4"]
[{"$nulls":6},249,"#4"]
[{"$nulls":6},250,"#5"]
[{"$nulls":6},251,"#5"]
[{"$nulls":6},252,"#5"]
[{"$nulls":6},253,"#5"]
[{"$nulls":6},254,"#5"]
[{"$nulls":6},255,"#5"]
[{"$nulls":6},256,"#5"]
[{"$nulls":6},257,"#5"]
[{"$nulls":6},258,"#5"]
[{"$nulls":6},{"$f":"+G265+1","v":259},"#5"]
[{"$nulls":6},260,"#5"]
[{"$nulls":6},261,"#5"]
[{"$nulls":6},262,"#5"]
[{"$nulls":6},263,"#5"]
[{"$nulls":6},264,"#5"]
[{"$nulls":6},265,"#5"]
[{"$nulls":6},266,"#5"]
[{"$nulls":6},267,"#5"]
[{"$nulls":6},268,"#5"]
[{"$nulls":6},269,"#5"]
[{"$nulls":6},270,"#5"]
[{"$nulls":6},271,"#5"]
[{"$nulls":6},272,"#5"]
[{"$nulls":6},273,"#5"]
[{"$nulls":6},274,"#5"]
[{"$nulls":6},275,"#5"]
[{"$nulls":6},276,"#5"]
[{"$nulls":6},277,"#5"]
[{"$nulls":6},278,"#5"]
[{"$nulls":6},279,"#5"]
[{"$nulls":6},280,"#5"]
[{"$nulls":6},281,"#5"]
[{"$nulls":6},282,"#5"]
[{"$nulls":6},283,"#5"]
[{"$nulls":6},284,"#5"]
[{"$nulls":6},285,"#5"]
[{"$nulls":6},286,"#5"]
[{"$nulls":6},287,"#5"]
[{"$nulls":6},288,"#5"]
[{"$nulls":6},289,"#5"]
[{"$nulls":6},290,"#5"]
[{"$nulls":6},291,"#5"]
[{"$nulls":6},292,"#5"]
[{"$nulls":6},293,"#5"]
[{"$nulls":6},294,"#5"]
[{"$nulls":6},295,"#5"]
[{"$nulls":6},296,"#5"]
[{"$nulls":6},297,"#5"]
[{"$nulls":6},298,"#5"]
[{"$nulls":6},299,"#5"]
[{"$nulls":6},300,"#5"]
[{"$nulls":6},301,"#5"]
[{"$nulls":6},302,"#5"]
[{"$nulls":6},303,"#5"]
[{"$nulls":6},304,"#5"]
[{"$nulls":6},305,"#5"]
[{"$nulls":6},306,"#5"]
[{"$nulls":6},307,"#5"]
[{"$nulls":6},308,"#5"]
[{"$nulls":6},309,"#5"]
[{"$nulls":6},310,"#5"]
[{"$nulls":6},311,"#5"]
[{"$nulls":6},312,"#5"]
[{"$nulls":6},313,"#5"]
[{"$nulls":6},314,"#5"]
[{"$nulls":6},315,"#5"]
[{"$nulls":6},316,"#5"]
[{"$nulls":6},317,"#5"]
[{"$nulls":6},318,"#5"]
[{"$nulls":6},319,"#5"]
[{"$nulls":6},320,"#5"]
[{"$nulls":6},321,"#5"]
[{"$nulls":6},322,"#5"]
[{"$nulls":6},{"$f":"+G329+1","v":323},"#5"]
[{"$nulls":6},324,"#5"]
[{"$nulls":6},325,"#5"]
[{"$nulls":6},326,"#5"]
[{"$nulls":6},327,"#5"]
[{"$nulls":6},328,"#5"]
[{"$nulls":6},329,"#5"]
[{"$nulls":6},330,"#5"]
[{"$nulls":6},331,"#5"]
[{"$nulls":6},332,"#5"]
[{"$nulls":6},333,"#5"]
[{"$nulls":6},334,"#5"]
[{"$nulls":6},335,"#5"]
[{"$nulls":6},336,"#5"]
[{"$nulls":6},337,"#5"]
[{"$nulls":6},338,"#5"]
[{"$nulls":6},339,"#5"]
[{"$nulls":6},340,"#5"]
[{"$nulls":6},341,"#5"]
[{"$nulls":6},342,"#5"]
[{"$nulls":6},343,"#5"]
[{"$nulls":6},344,"#5"]
[{"$nulls":6},345,"#5"]
[{"$nulls":6},346,"#5"]
[{"$nulls":6},347,"#5"]
[{"$nulls":6},348,"#5"]
[{"$nulls":6},349,"#5"]
[{"$nulls":6},350,"#6"]
[{"$nulls":6},351,"#6"]
[{"$nulls":6},352,"#6"]
[{"$nulls":6},353,"#6"]
[{"$nulls":6},354,"#6"]
[{"$nulls":6},355,"#6"]
[{"$nulls":6},356,"#6"]
[{"$nulls":6},357,"#6"]
[{"$nulls":6},358,"#6"]
[{"$nulls":6},359,"#6"]
[{"$nulls":6},360,"#6"]
[{"$nulls":6},361,"#6"]
[{"$nulls":6},362,"#6"]
[{"$nulls":6},363,"#6"]
[{"$nulls":6},364,"#6"]
[{"$nulls":6},365,"#6"]
[{"$nulls":6},366,"#6"]
[{"$nulls":6},367,"#6"]
[{"$nulls":6},368,"#6"]
[{"$nulls":6},369,"#6"]
[{"$nulls":6},370,"#6"]
[{"$nulls":6},371,"#6"]
[{"$nulls":6},372,"#6"]
[{"$nulls":6},373,"#6"]
[{"$nulls":6},374,"#6"]
[{"$nulls":6},375,"#6"]
[{"$nulls":6},376,"#6"]
[{"$nulls":6},377,"#6"]
[{"$nulls":6},378,"#6"]
[{"$nulls":6},379,"#6"]
[{"$nulls":6},380,"#6"]
[{"$nulls":6},381,"#6"]
[{"$nulls":6},382,"#6"]
[{"$nulls":6},383,"#6"]
[{"$nulls":6},384,"#6"]
[{"$nulls":6},385,"#6"]
[{"$nulls":6},386,"#6"]
[{"$nulls":6},{"$f":"+G393+1","v":387},"#6"]
[{"$nulls":6},388,"#6"]
[{"$nulls":6},389,"#6"]
[{"$nulls":6},390,"#6"]
[{"$nulls":6},391,"#6"]
[{"$nulls":6},392,"#6"]
[{"$nulls":6},393,"#6"]
[{"$nulls":6},394,"#6"]
[{"$nulls":6},395,"#6"]
[{"$nulls":6},396,"#6"]
[{"$nulls":6},397,"#6"]
[{"$nulls":6},398,"#6"]
[{"$nulls":6},399,"#6"]
[{"$nulls":6},400,"#6"]
[{"$nulls":6},401,"#6"]
[{"$nulls":6},402,"#6"]
[{"$nulls":6},403,"#6"]
[{"$nulls":6},404,"#6"]
[{"$nulls":6},405,"#6"]
[{"$nulls":6},406,"#6"]
[{"$nulls":6},407,"#6"]
[{"$nulls":6},408,"#6"]
[{"$nulls":6},409,"#6"]
[{"$nulls":6},410,"#6"]
[{"$nulls":6},411,"#6"]
[{"$nulls":6},412,"#6"]
[{"$nulls":6},413,"#6"]
[{"$nulls":6},414,"#6"]
[{"$nulls":6},415,"#6"]
[{"$nulls":6},416,"#6"]
[{"$nulls":6},417,"#6"]
[{"$nulls":6},418,"#6"]
[{"$nulls":6},419,"#6"]
[{"$nulls":6},420,"#6"]
[{"$nulls":6},421,"#6"]
[{"$nulls":6},422,"#6"]
[{"$nulls":6},423,"#6"]
[{"$nulls":6},424,"#6"]
[{"$nulls":6},425,"#6"]
[{"$nulls":6},426,"#6"]
[{"$nulls":6},427,"#6"]
[{"$nulls":6},428,"#6"]
[{"$nulls":6},429,"#6"]
[{"$nulls":6},430,"#6"]
[{"$nulls":6},431,"#6"]
[{"$nulls":6},432,"#6"]
[{"$nulls":6},433,"#6"]
[{"$nulls":6},434,"#6"]
[{"$nulls":6},435,"#6"]
[{"$nulls":6},436,"#6"]
[{"$nulls":6},437,"#6"]
[{"$nulls":6},438,"#6"]
[{"$nulls":6},439,"#6"]
[{"$nulls":6},440,"#6"]
[{"$nulls":6},441,"#6"]
[{"$nulls":6},442,"#6"]
[{"$nulls":6},443,"#6"]
[{"$nulls":6},444,"#6"]
[{"$nulls":6},445,"#6"]
[{"$nulls":6},446,"#6"]
[{"$nulls":6},447,"#6"]
[{"$nulls":6},448,"#6"]
[{"$nulls":6},449,"#6"]
[{"$nulls":6},450,"#6"]
[{"$nulls":6},{"$f":"+G457+1","v":451},"#6"]
[{"$nulls":6},452,"#6"]
[{"$nulls":6},453,"#6"]
[{"$nulls":6},454,"#6"]
[{"$nulls":6},455,"#6"]
[{"$nulls":6},456,"#6"]
[{"$nulls":6},457,"#6"]
[{"$nulls":6},458,"#6"]
[{"$nulls":6},459,"#6"]
[{"$nulls":6},460,"#6"]
[{"$nulls":6},461,"#6"]
[{"$nulls":6},462,"#6"]
[{"$nulls":6},463,"#6"]
[{"$nulls":6},464,"#6"]
[{"$nulls":6},465,"#6"]
[{"$nulls":6},466,"#6"]
[{"$nulls":6},467,"#6"]
[{"$nulls":6},468,"#6"]
[{"$nulls":6},469,"#6"]
[{"$nulls":6},470,"#6"]
[{"$nulls":6},471,"#6"]
[{"$nulls":6},472,"#6"]
[{"$nulls":6},473,"#6"]
[{"$nulls":6},474,"#6"]
[{"$nulls":6},475,"#6"]
[{"$nulls":6},476,"#6"]
[{"$nulls":6},477,"#6"]
[{"$nulls":6},478,"#6"]
[{"$nulls":6},479,"#6"]
[{"$nulls":6},480,"#6"]
[{"$nulls":6},481,"#6"]
[{"$nulls":6},482,"#6"]
[{"$nulls":6},483,"#6"]
[{"$nulls":6},484,"#6"]
[{"$nulls":6},485,"#6"]
[{"$nulls":6},486,"#6"]
[{"$nulls":6},487,"#6"]
[{"$nulls":6},488,"#6"]
[{"$nulls":6},489,"#6"]
[{"$nulls":6},490,"#6"]
[{"$nulls":6},491,"#6"]
[{"$nulls":6},492,"#6"]
[{"$nulls":6},493,"#6"]
[{"$nulls":6},494,"#6"]
[{"$nulls":6},495,"#6"]
[{"$nulls":6},496,"#6"]
[{"$nulls":6},497,"#6"]
[{"$nulls":6},498,"#6"]
[{"$nulls":6},499,"#6"]