{"text_format":"3","workbook":"xlsx","n_sheets":13,"sheets":["Instruction Sheet","Price Sheet","Order Form","Lists","Summary Sheet","ClassicData","ClassicBreakdown","BuckleData","BuckleBreakdown","Go-In! & Fast Eddie Package BD","Go-In! & Fast Eddie Data","Go-In! & Fast Eddie Buckle BD","Go-In! & Fast Eddie Buckle Data"],"not_rendered":{"images":14,"macros":1,"defined_names":27},"read":"whole","date_system":"1900"}

{"sheet":"Instruction Sheet","index":0,"n_rows":97,"n_cols":15,"rows_kept":97,"merged":[[54,1,54,10],[65,1,65,3],[65,5,65,8],[65,10,65,12]]}
[]
[]
[]
[{"$nulls":7},"ORDER ENTRY FORM INSTRUCTIONS "]
[]
[]
["NOTE: This is a template form, so please save a copy that can be reused.  Please do not reuse the template for multiple orders."]
[]
["Order Entry Instructions"]
[]
{"$rows_left_out":71}
{"sheet":"Price Sheet","index":1,"n_rows":142,"n_cols":11,"rows_kept":142,"merged":[[104,1,104,3]]}
[]
[]
[]
[]
[]
[]
[null,"Customization Selection and Price Sheet"]
[]
[null,"Please follow the step-by-step listing below to explore your customization options"]
[]
{"$rows_left_out":133}
{"sheet":"Order Form","index":2,"n_rows":99,"n_cols":24,"rows_kept":99,"merged":[[0,3,3,6],[7,1,7,2],[7,3,7,6],[7,8,7,9],[8,1,8,2],[8,3,8,6],[9,1,9,2],[9,3,9,6],[12,3,12,7],[13,3,13,6],[14,3,14,5],[15,3,15,5],[15,7,15,8],[16,3,16,5],[19,3,19,9],[20,3,20,9],[21,3,21,5],[22,3,22,5],[22,7,22,8],[23,3,23,5],[26,3,26,4],[26,7,26,8],[27,3,27,4],[27,7,27,8],[28,3,28,4],[28,7,28,8],[71,1,71,3],[71,5,74,8],[72,1,72,3],[73,1,73,3],[74,1,74,3],[77,1,77,8],[78,1,78,8],[79,1,79,8],[80,1,80,8]]}
[{"$nulls":3},"Custom Order Form"]
[{"$nulls":9},"10390 Regis Court"]
[{"$nulls":9},"Rancho Cucamonga, CA  91730"]
[{"$nulls":9},"Phone: 909-758-0079  Fax: 866-610-4573"]
[{"$nulls":9},"Rev. January  19th, 2021"]
[]
[null,"Order Information"]
[null,"Order Date:",{"$nulls":6},"Shipping Window"]
[null,"Customer PO:",{"$nulls":6},"From:"]
[null,"Rep Name:",{"$nulls":6},"To:"]
{"$rows_left_out":75}
{"sheet":"Lists","index":3,"n_rows":131,"n_cols":14,"rows_kept":131,"hidden":true}
[]
[null,"Master Lists"]
[]
[null,"Price Level",null,"Customization",null,"Buckles",null,"Straps",{"$nulls":3},"Packaging",null,"BallMarkTool"]
[]
[null,"PriceLevel",null,"Customization",null,"Embossed",null,"Strap",null,"LogoPlacement",null,"Packaging",null,"BallMarkTool"]
[]
[null,"#1",null,"Embossed",null,"(BGG7783) Go-In! Blank Gunmetal Beveled",null,"(SEL0869) Smooth Black",null,"Full (Center)",null,"Poly Carbonate Box",null,"Standard Ball Mark"]
[null,"#2",null,"Debossed",null,"(BGG7790) Go-In! Blank Nickel Beveled",null,"(SEL0760) Carbon Black",null,"Lower Right Corner (Reduced)",null,"Tournament Packaging",null,"Ball Mark - Etched Logo (add $3)"]
[null,"#3",null,"Etched",null,"(BCE7813) Classic Blank Gunmetal Beveled",null,"(SEL4683) Espresso",null,"Front logo hat only",null,"Tourney Pkg w/ Logo (add $1)",null,"Ball Mark - Color Logo (add $3)"]
{"$rows_left_out":114}
{"sheet":"Summary Sheet","index":4,"n_rows":175,"n_cols":5,"rows_kept":175,"hidden":true}
["Custom Order Form",null,"Customer Name:",{"$f":"'Order Form'!D13","v":0}]
["Order Summary",null,"Order Date:",{"$f":"+'Order Form'!D8","v":"00:00:00"}]
[null,null,"Customer PO:",{"$f":"+'Order Form'!D9","v":0}]
[]
["Customization","Buckle","Logo Placement","Item Code","Qty"]
["Etched","(BGG5406) Go-In! Gunmetal Beveled","Full (Center)",null,{"$f":"SUMIFS('Order Form'!$I$34:$I$67,'Order Form'!$B$34:$B$67,A6,'Order Form'!$C$34:$C$67,B6,'Order Form'!$D$34:$D$67,C6)","v":0}]
["Etched","(BGG4508) Go-In! Brushed Nickel Beveled","Full (Center)",null,{"$f":"SUMIFS('Order Form'!$I$34:$I$67,'Order Form'!$B$34:$B$67,A7,'Order Form'!$C$34:$C$67,B7,'Order Form'!$D$34:$D$67,C7)","v":0}]
["Etched","(BGG1576) Go-In! Brass ","Full (Center)",null,{"$f":"SUMIFS('Order Form'!$I$34:$I$67,'Order Form'!$B$34:$B$67,A8,'Order Form'!$C$34:$C$67,B8,'Order Form'!$D$34:$D$67,C8)","v":0}]
["Etched","(BGG5383) Go-In! Stealth Beveled","Full (Center)",null,{"$f":"SUMIFS('Order Form'!$I$34:$I$67,'Order Form'!$B$34:$B$67,A9,'Order Form'!$C$34:$C$67,B9,'Order Form'!$D$34:$D$67,C9)","v":0}]
["Etched","(BGG1835) Go-In! Matte Nickel*","Full (Center)",null,{"$f":"SUMIFS('Order Form'!$I$34:$I$67,'Order Form'!$B$34:$B$67,A10,'Order Form'!$C$34:$C$67,B10,'Order Form'!$D$34:$D$67,C10)","v":0}]
{"$rows_left_out":166}
{"sheet":"ClassicData","index":5,"n_rows":506,"n_cols":42,"rows_kept":506,"hidden":true}
[]
[]
[{"$nulls":4},"classic"]
[{"$nulls":9},"Embossed / Debossed",null,null,"Polished Plate",null,null,"Custom Ribbon",null,"Custom Caps"]
[{"$nulls":6},"Etched / Printed",null,null,"Price Level",null,null,"Price Level",null,null,"Price Level",null,"Price Level",null,null,"Strap",{"$nulls":3},"Presentation Box",null,null,"BM / Tool",{"$nulls":3},"StrapOnlyPricing "]
[null,"Price Levels",null,"Price Sumamry",null,null,"Price Level",null,null,"Qty","Price",null,"Qty","Price",null,"Qty","Price","Qty","Price",null,"Price Adjust",{"$nulls":3},"Price Adjust",null,null,"Price Adjust",{"$nulls":3},"Price Adjust",{"$nulls":8},"Strap Only OLD"]
[]
[null,"#1",null,"#1",{"v":38,"d":"38.00"},null,1,"#1",null,50,{"v":49,"d":"49.00"},null,200,{"v":33,"d":"33.00"},null,50,{"v":35,"d":"35.00"},12,{"v":15,"d":"15.00"},null,"(SEL0869) Smooth Black",0,null,null,"Poly Carbonate Box",0,null,"Standard Ball Mark",0,null,null,"(SEL0869) Smooth Black",{"v":20,"d":"20.00"},null,null,"#1","1-23",{"$nulls":3},"(SEL0760) Carbon Black",{"v":20,"d":"20.00"}]
[null,"#2",null,"#2",{"v":36,"d":"36.00"},null,{"$f":"+G8+1","v":2},"#1",null,51,{"v":49,"d":"49.00"},null,201,{"v":33,"d":"33.00"},null,51,{"v":35,"d":"35.00"},13,{"v":15,"d":"15.00"},null,"(SEL0760) Carbon Black",0,null,null,"Tournament Packaging",0,null,"Ball Mark - Etched Logo (add $3)",{"v":3,"d":"3.00"},null,null,"(SEL0760) Carbon Black",{"v":20,"d":"20.00"},null,null,"#2","24-99",{"$nulls":3},"(SEL0845) Carbon White",{"v":20,"d":"20.00"}]
[null,"#3",null,"#3",{"v":33,"d":"33.00"},null,{"$f":"+G9+1","v":3},"#1",null,52,{"v":49,"d":"49.00"},null,202,{"v":33,"d":"33.00"},null,52,{"v":35,"d":"35.00"},14,{"v":15,"d":"15.00"},null,"(SEL4683) Espresso",0,null,null,"Tourney Pkg w/ Logo (add $1)",{"v":1,"d":"1.00"},null,"Ball Mark - Color Logo (add $3)",{"v":3,"d":"3.00"},null,null,"(SEL4683) Espresso",{"v":20,"d":"20.00"},null,null,"#3","100-199",{"$nulls":3},"(SCL4270) Deep Sea",{"v":20,"d":"20.00"}]
{"$rows_left_out":497}
{"sheet":"ClassicBreakdown","index":6,"n_rows":53,"n_cols":17,"rows_kept":53,"hidden":true}
[]
[]
[]
[null,null,"QTY","Grandfather Price","Order Price Level","Order Price","Order Rate"]
[null,null,{"$f":"SUM(B8:C27)","v":0},{"$f":"IF(ISBLANK('Order Form'!B31),ClassicData!$E$8,VLOOKUP('Order Form'!B31,ClassicData!$D:$E,2,FALSE))","v":{"v":38,"d":"$38"}},{"$f":"IFERROR(VLOOKUP(C5,ClassicData!G:H,2,FALSE),\"#1\")","v":"#1"},{"$f":"VLOOKUP(E5,ClassicData!$D:$E,2,FALSE)","v":{"v":38,"d":"$38.00"}},{"$f":"MIN(D5,F5)","v":{"v":38,"d":"$38.00"}}]
[{"$nulls":4},{"$f":"VLOOKUP(E5,'Order Form'!F94:G99,2,FALSE)","v":1},{"$nulls":5},"QTY","Order Rate",{"$nulls":3},"QTY","Order Rate"]
[null,"Etched","ColorPrint",{"$nulls":7},{"$f":"SUM(J9:J28)","v":0},{"$f":"IF(K7<50,\"Less Than MOQ\",VLOOKUP(K7,ClassicData!$J:$K,2,FALSE))","v":"Less Than MOQ"},{"$nulls":3},{"$f":"SUM(O9:O28)","v":0},{"$f":"IF(P7<50,\"Less Than MOQ\",VLOOKUP(P7,ClassicData!$P:$Q,2,FALSE))","v":"Less Than MOQ"}]
[null,{"$f":"IF('Order Form'!B34=ClassicBreakdown!$B$7,+'Order Form'!I34,0)","v":0},{"$f":"IF('Order Form'!B34=ClassicBreakdown!$C$7,+'Order Form'!I34,0)","v":0},{"$nulls":6},"Embossed",{"$nulls":4},"CustomRibbon"]
[null,{"$f":"IF('Order Form'!B35=ClassicBreakdown!$B$7,+'Order Form'!I35,0)","v":0},{"$f":"IF('Order Form'!B35=ClassicBreakdown!$C$7,+'Order Form'!I35,0)","v":0},{"$nulls":6},{"$f":"IF('Order Form'!B34=ClassicBreakdown!$J$8,+'Order Form'!I34,0)","v":0},{"$nulls":4},{"$f":"IF('Order Form'!B34=ClassicBreakdown!$O$8,+'Order Form'!I34,0)","v":0}]
[null,{"$f":"IF('Order Form'!B36=ClassicBreakdown!$B$7,+'Order Form'!I36,0)","v":0},{"$f":"IF('Order Form'!B36=ClassicBreakdown!$C$7,+'Order Form'!I36,0)","v":0},{"$nulls":6},{"$f":"IF('Order Form'!B35=ClassicBreakdown!$J$8,+'Order Form'!I35,0)","v":0},{"$nulls":4},{"$f":"IF('Order Form'!B35=ClassicBreakdown!$O$8,+'Order Form'!I35,0)","v":0}]
{"$rows_left_out":44}
{"sheet":"BuckleData","index":7,"n_rows":506,"n_cols":18,"rows_kept":506,"hidden":true}
[]
[]
[]
[]
[{"$nulls":6},"Etched / Printed",null,null,"Embossed / Debossed",null,null,"Polished Plate",{"$nulls":3},"BM / Tool"]
[null,"Price Levels",null,"Price Sumamry",null,null,"Price Level",null,null,"Price Level",null,null,"Price Level",{"$nulls":3},"Price Adjust"]
[]
[null,"#1",null,"#1",{"v":18,"d":"18.00"},null,1,"#1",null,50,29,null,50,21,null,null,"Standard Ball Mark",0]
[null,"#2",null,"#2",{"v":17,"d":"17.00"},null,{"$f":"+G8+1","v":2},"#1",null,51,29,null,51,21,null,null,"Ball Mark - Etched Logo (add $3)",3]
[null,"#3",null,"#3",{"v":16,"d":"16.00"},null,{"$f":"+G9+1","v":3},"#1",null,52,29,null,52,21,null,null,"Ball Mark - Color Logo (add $3)",3]
{"$rows_left_out":497}
{"sheet":"BuckleBreakdown","index":8,"n_rows":33,"n_cols":12,"rows_kept":33,"hidden":true}
[]
[]
[]
[null,null,"QTY","Grandfather Price","Order Price Level","Order Price","Order Rate"]
[null,null,{"$f":"SUM(B8:C17)","v":0},{"$f":"IF(ISBLANK('Order Form'!B31),BuckleData!E8,VLOOKUP('Order Form'!B31,BuckleData!$D:$E,2,FALSE))","v":{"v":18,"d":"$18"}},{"$f":"IFERROR(VLOOKUP(C5,BuckleData!G:H,2,FALSE),\"#1\")","v":"#1"},{"$f":"VLOOKUP(E5,BuckleData!$D:$E,2,FALSE)","v":{"v":18,"d":"$18.00"}},{"$f":"MIN(D5,F5)","v":{"v":18,"d":"$18.00"}}]
[{"$nulls":4},{"$f":"VLOOKUP(E5,'Order Form'!F94:G99,2,FALSE)","v":1},{"$nulls":5},"QTY","Order Rate"]
[null,"Etched","ColorPrint",{"$nulls":7},{"$f":"SUM(J9:J18)","v":0},{"$f":"IF(K7<50,\"Less Than MOQ\",VLOOKUP(K7,BuckleData!$J:$K,2,FALSE))","v":"Less Than MOQ"}]
[null,{"$f":"IF('Order Form'!B58=BuckleBreakdown!$B$7,+'Order Form'!I58,0)","v":0},{"$f":"IF('Order Form'!B58=BuckleBreakdown!$C$7,+'Order Form'!I58,0)","v":0},{"$nulls":6},"Embossed"]
[null,{"$f":"IF('Order Form'!B59=BuckleBreakdown!$B$7,+'Order Form'!I59,0)","v":0},{"$f":"IF('Order Form'!B59=BuckleBreakdown!$C$7,+'Order Form'!I59,0)","v":0},{"$nulls":6},{"$f":"IF('Order Form'!B58=BuckleBreakdown!$J$8,+'Order Form'!I58,0)","v":0}]
[null,{"$f":"IF('Order Form'!B60=BuckleBreakdown!$B$7,+'Order Form'!I60,0)","v":0},{"$f":"IF('Order Form'!B60=BuckleBreakdown!$C$7,+'Order Form'!I60,0)","v":0},{"$nulls":6},{"$f":"IF('Order Form'!B59=BuckleBreakdown!$J$8,+'Order Form'!I59,0)","v":0}]
{"$rows_left_out":24}
{"sheet":"Go-In! & Fast Eddie Package BD","index":9,"n_rows":54,"n_cols":17,"rows_kept":54,"hidden":true}
[]
[null,"Go-In!",{"$nulls":9},"Go-In!"]
[null,null,"QTY","Grandfather Price","Order Price Level","Order Price","Order Rate",{"$nulls":5},"QTY","Grandfather Price","Order Price Level","Order Price","Order Rate"]
[null,null,{"$f":"SUM(B7:C26)","v":0},{"$f":"IF(ISBLANK('Order Form'!$B$31),'Go-In! & Fast Eddie Data'!E8,VLOOKUP('Order Form'!$B$31,'Go-In! & Fast Eddie Data'!$D:$E,2,FALSE))","v":{"v":4,"d":"$4.00"}},{"$f":"IFERROR(VLOOKUP(C4,'Go-In! & Fast Eddie Data'!G:H,2,FALSE),\"#1\")","v":"#1"},{"$f":"VLOOKUP(E4,'Go-In! & Fast Eddie Data'!$D:$E,2,FALSE)","v":{"v":4,"d":"$4.00"}},{"$f":"MIN(D4,F4)","v":{"v":4,"d":"$4.00"}},{"$nulls":5},{"$f":"SUM(L7:L26)","v":0},{"$f":"IF(ISBLANK('Order Form'!$B$31),'Go-In! & Fast Eddie Data'!E8,VLOOKUP('Order Form'!$B$31,'Go-In! & Fast Eddie Data'!$D:$E,2,FALSE))","v":{"v":4,"d":"$4.00"}},{"$f":"IFERROR(VLOOKUP(M4,'Go-In! & Fast Eddie Data'!G:H,2,FALSE),\"#1\")","v":"#1"},{"$f":"VLOOKUP(O4,'Go-In! & Fast Eddie Data'!D:E,2,FALSE)","v":{"v":4,"d":"$4.00"}},{"$f":"MIN(N4,P4)","v":{"v":4,"d":"$4.00"}}]
[{"$nulls":4},{"$f":"VLOOKUP(E4,'Order Form'!F93:G98,2,FALSE)","v":1}]
[null,"Etched","ColorPrint",{"$nulls":8},"Polished Plate"]
[null,{"$f":"IF('Order Form'!B34='Go-In! & Fast Eddie Package BD'!$B$6,+'Order Form'!I34,0)","v":0},{"$f":"IF('Order Form'!B34='Go-In! & Fast Eddie Package BD'!$C$6,+'Order Form'!I34,0)","v":0},{"$nulls":8},{"$f":"IF('Order Form'!B34='Go-In! & Fast Eddie Package BD'!$L$6,+'Order Form'!I34,0)","v":0}]
[null,{"$f":"IF('Order Form'!B35='Go-In! & Fast Eddie Package BD'!$B$6,+'Order Form'!I35,0)","v":0},{"$f":"IF('Order Form'!B35='Go-In! & Fast Eddie Package BD'!$C$6,+'Order Form'!I35,0)","v":0},{"$nulls":8},{"$f":"IF('Order Form'!B35='Go-In! & Fast Eddie Package BD'!$L$6,+'Order Form'!I35,0)","v":0}]
[null,{"$f":"IF('Order Form'!B36='Go-In! & Fast Eddie Package BD'!$B$6,+'Order Form'!I36,0)","v":0},{"$f":"IF('Order Form'!B36='Go-In! & Fast Eddie Package BD'!$C$6,+'Order Form'!I36,0)","v":0},{"$nulls":8},{"$f":"IF('Order Form'!B36='Go-In! & Fast Eddie Package BD'!$L$6,+'Order Form'!I36,0)","v":0}]
[null,{"$f":"IF('Order Form'!B37='Go-In! & Fast Eddie Package BD'!$B$6,+'Order Form'!I37,0)","v":0},{"$f":"IF('Order Form'!B37='Go-In! & Fast Eddie Package BD'!$C$6,+'Order Form'!I37,0)","v":0},{"$nulls":8},{"$f":"IF('Order Form'!B37='Go-In! & Fast Eddie Package BD'!$L$6,+'Order Form'!I37,0)","v":0}]
{"$rows_left_out":45}
{"sheet":"Go-In! & Fast Eddie Data","index":10,"n_rows":506,"n_cols":13,"rows_kept":506,"hidden":true}
[]
[]
[null,"Go-In!",{"$nulls":7},"Fast Eddie"]
[]
[{"$nulls":6},"Etched / Printed"]
[null,"Price Levels",null,"Price Sumamry",null,null,"Price Level",null,null,"Price Levels",null,"Price Summary"]
[]
[null,"#1",null,"#1",{"v":4,"d":"4.00"},null,1,"#1",null,"#1",null,"#1",6.5]
[null,"#2",null,"#2",{"v":3,"d":"3.00"},null,{"$f":"+G8+1","v":2},"#1",null,"#2",null,"#2",5.5]
[null,"#3",null,"#3",{"v":2,"d":"2.00"},null,{"$f":"+G9+1","v":3},"#1",null,"#3",null,"#3",4.5]
{"$rows_left_out":497}
{"sheet":"Go-In! & Fast Eddie Buckle BD","index":11,"n_rows":42,"n_cols":17,"rows_kept":42,"hidden":true}
[]
[null,"Go-In!",{"$nulls":9},"Go-In!"]
[null,null,"QTY","Grandfather Price","Order Price Level","Order Price","Order Rate",{"$nulls":5},"QTY","Grandfather Price","Order Price Level","Order Price","Order Rate"]
[null,null,{"$f":"SUM(B7:C16)","v":0},{"$f":"IF(ISBLANK('Order Form'!$B$31),'Go-In! & Fast Eddie Buckle Data'!E8,VLOOKUP('Order Form'!$B$31,'Go-In! & Fast Eddie Buckle Data'!$D:$E,2,FALSE))","v":{"v":4,"d":"$4.00"}},{"$f":"IFERROR(VLOOKUP(C4,'Go-In! & Fast Eddie Buckle Data'!G:H,2,FALSE),\"#1\")","v":"#1"},{"$f":"VLOOKUP(E4,'Go-In! & Fast Eddie Buckle Data'!D:E,2,FALSE)","v":{"v":4,"d":"$4.00"}},{"$f":"MIN(D4,F4)","v":{"v":4,"d":"$4.00"}},{"$nulls":5},{"$f":"SUM(L7:L16)","v":0},{"$f":"IF(ISBLANK('Order Form'!$B$31),'Go-In! & Fast Eddie Buckle Data'!E8,VLOOKUP('Order Form'!$B$31,'Go-In! & Fast Eddie Buckle Data'!$D:$E,2,FALSE))","v":{"v":4,"d":"$4.00"}},{"$f":"IFERROR(VLOOKUP(M4,'Go-In! & Fast Eddie Buckle Data'!G:H,2,FALSE),\"#1\")","v":"#1"},{"$f":"VLOOKUP(O4,'Go-In! & Fast Eddie Buckle Data'!D:E,2,FALSE)","v":{"v":4,"d":"$4.00"}},{"$f":"MIN(N4,P4)","v":{"v":4,"d":"$4.00"}}]
[{"$nulls":4},{"$f":"VLOOKUP(E4,'Order Form'!F93:G98,2,FALSE)","v":1}]
[null,"Etched","ColorPrint",{"$nulls":8},"Polished Plate"]
[null,{"$f":"IF('Order Form'!B58=$B$6,+'Order Form'!I58,0)","v":0},{"$f":"IF('Order Form'!B58=$C$6,+'Order Form'!I58,0)","v":0},{"$nulls":8},{"$f":"IF('Order Form'!B58=$L$6,+'Order Form'!I58,0)","v":0}]
[null,{"$f":"IF('Order Form'!B59=$B$6,+'Order Form'!I59,0)","v":0},{"$f":"IF('Order Form'!B59=$C$6,+'Order Form'!I59,0)","v":0},{"$nulls":8},{"$f":"IF('Order Form'!B59=$L$6,+'Order Form'!I59,0)","v":0}]
[null,{"$f":"IF('Order Form'!B60=$B$6,+'Order Form'!I60,0)","v":0},{"$f":"IF('Order Form'!B60=$C$6,+'Order Form'!I60,0)","v":0},{"$nulls":8},{"$f":"IF('Order Form'!B60=$L$6,+'Order Form'!I60,0)","v":0}]
[null,{"$f":"IF('Order Form'!B61=$B$6,+'Order Form'!I61,0)","v":0},{"$f":"IF('Order Form'!B61=$C$6,+'Order Form'!I61,0)","v":0},{"$nulls":8},{"$f":"IF('Order Form'!B61=$L$6,+'Order Form'!I61,0)","v":0}]
{"$rows_left_out":23}
{"sheet":"Go-In! & Fast Eddie Buckle Data","index":12,"n_rows":506,"n_cols":13,"rows_kept":506,"hidden":true}
[]
[]
[null,"Go-In!",{"$nulls":7},"Fast Eddie"]
[]
[{"$nulls":6},"Etched / Printed"]
[null,"Price Levels",null,"Price Sumamry",null,null,"Price Level",null,null,"Price Levels",null,"Price Summary"]
[]
[null,"#1",null,"#1",{"v":4,"d":"4.00"},null,1,"#1",null,"#1",null,"#1",6.5]
[null,"#2",null,"#2",{"v":3,"d":"3.00"},null,{"$f":"+G8+1","v":2},"#1",null,"#2",null,"#2",5.5]
[null,"#3",null,"#3",{"v":2,"d":"2.00"},null,{"$f":"+G9+1","v":3},"#1",null,"#3",null,"#3",4.5]
{"$rows_left_out":496}