{"text_format":"3","workbook":"xlsx","n_sheets":5,"sheets":["Instructions","Order","Flag Entry Sheet","Rowland Thomas Entry Sheet","Data"],"not_rendered":{"images":15,"macros":1,"defined_names":7,"comments":1},"read":"whole","date_system":"1900"}

{"sheet":"Instructions","index":0,"n_rows":136,"n_cols":10,"rows_kept":136}
[]
[]
[]
[{"$nulls":7},"ORDER ENTRY FORM INSTRUCTIONS "]
[]
[]
[null,"About this Order Form"]
[]
[null,"The Order Form can be printed for manual entry / computation or used as an Excel document. The Order Form operates by executing a macro. "]
[null,"The macro has been programmed to work with Excel 2013 or higher.  To confirm what version of Excel you are using go to File/Account.  On the"]
[null,"right side of the screen the version of Excel should be visible."]
[]
[null,"NOTE: This is a template form, so please save a copy that can be reused.  Please do not reuse the template for multiple orders."]
[]
[null,"Order Entry Instructions"]
[]
[null,"Before you can enter data, please click the box under the Tool Bar titled \"Enabled Editing\"."]
[]
[]
[]
[null,"Order Information / Billing / Shipping / Payment "]
[null,"Please enter all applicable information."]
[]
[null,"Product Selection"]
[null,"The form has been organized to follow along with the 2017 Nexbelt Catalog.  On the far left side of the form we have provided references ot the "]
[null,"pages in the catalog.  Item Descriptions and Part No.'s on the form correspond to those in the catalog."]
[]
[null,"The entire form with all of the products listed may be prinited, if desired."]
[]
[null,"All of the products in the catalog are listed on the form.  Please select the quanities of each itme ordered.  A total cost for the items selected is"]
[null,"provided at the bottom of the form."]
[]
[null,"We have left room at the bottom of thre form for entry of product items that may not be in the catalog.  Please provide as much information as"]
[null,"possible when adding items that are not in the catalog.  A clear description and price are essential, and idelaly we would like a Part No..  If you"]
[null,"do not have this information, your Sales Representative or Customer Service Department (909-758-0079) can assist."]
[]
[null,"There is an Order Notes section at the bottom of the form.  Please use this for any special requests or other information you would like to"]
[null,"include with the order.  "]
[]
[null,"Reviewing Your Order"]
{"$rows_left_out":67}
{"sheet":"Order","index":1,"n_rows":308,"n_cols":13,"rows_kept":308,"merged":[[7,1,7,2],[7,3,7,6],[8,1,8,2],[8,3,8,6],[9,1,9,2],[9,3,9,6],[12,1,12,2],[12,3,12,7],[13,1,13,2],[13,3,13,6],[14,1,14,2],[14,3,14,5],[15,1,15,2],[15,3,15,5],[15,7,15,8],[16,1,16,2],[16,3,16,5],[19,1,19,2],[19,3,19,9],[20,1,20,2],[20,3,20,9],[21,1,21,2],[21,3,21,5],[22,1,22,2],[22,3,22,5],[22,7,22,8],[23,1,23,2],[23,3,23,5],[26,1,26,2],[26,3,26,4],[26,7,26,8],[27,1,27,2],[27,3,27,4],[27,7,27,8],[28,1,28,2],[28,3,28,4],[28,7,28,8],[30,1,30,8],[32,0,37,0],[38,0,43,0],[44,0,48,0],[49,0,51,0],[52,0,59,0],[60,0,63,0],[64,0,66,0],[67,0,70,0],[67,1,67,3],[68,1,68,3],[69,1,69,3],[70,1,70,3],[71,0,80,0],[81,0,95,0],[81,1,81,3],[87,1,87,3],[88,1,88,3],[89,1,89,3],[90,1,90,3],[91,1,91,3],[93,1,93,3],[95,1,95,3],[96,0,99,0],[100,0,103,0],[104,0,105,0],[104,1,104,3],[106,0,108,0],[109,0,112,0],[109,1,109,3],[110,1,110,3],[111,1,111,3],[112,1,112,3],[113,0,114,0],[115,0,120,0],[121,0,122,0],[123,0,124,0],[123,1,123,3],[124,1,124,3],[125,0,128,0],[129,0,134,0],[135,0,140,0],[141,0,142,0],[143,0,144,0],[145,0,146,0],[147,0,150,0],[151,0,153,0],[154,0,155,0],[156,0,157,0],[158,0,161,0],[160,1,160,3],[161,1,161,3],[162,0,168,0],[169,0,189,0],[190,0,222,0],[190,1,190,3],[194,1,194,3],[195,1,195,3],[196,1,196,3],[197,1,197,3],[198,1,198,3],[199,1,199,3],[200,1,200,3],[202,1,202,3],[203,1,203,3],[204,1,204,3],[205,1,205,3],[206,1,206,3],[207,1,207,3],[208,1,208,3],[209,1,209,3],[210,1,210,3],[213,1,213,3],[214,1,214,3],[216,1,216,3],[218,1,218,3],[219,1,219,3],[220,1,220,3],[221,1,221,3],[222,1,222,3],[223,0,254,0],[255,0,266,0],[267,0,271,0],[272,0,281,0],[282,0,289,0]]}
[{"$nulls":9},"2021 Stock Order Form"]
[{"$nulls":9},"10390 Regis Ct"]
[{"$nulls":5},"2021-01-18",{"$nulls":3},"Rancho Cucamonga, CA  91730"]
[{"$nulls":9},"Phone: 909-758-0079  Fax: 866-610-4573"]
[]
[]
[null,"Order Information:"]
[null,"Order Date:",{"$nulls":6},"Shipping Window"]
[null,"Customer PO:",{"$nulls":6},"From:"]
[null,"Rep Name:",{"$nulls":6},"To:"]
[]
[null,"Billing Information:"]
[null,"Customer Name:",{"$nulls":6},"Member #:"]
[null,"Address:"]
[null,"City:",{"$nulls":4},"State:",null,"Zip:"]
[null,"Contact:",{"$nulls":4},"Phone:"]
[null,"Email:"]
[]
[null,"Shipping Information:"]
[null,"Customer Name:",null,"Same as Billing information above"]
[null,"Address:"]
[null,"City:",{"$nulls":4},"State:",null,"Zip:"]
[null,"Contact:",{"$nulls":4},"Phone:"]
[null,"Email:"]
[]
[null,"Payment Information:"]
[null,"Credit Card:",{"$nulls":4},"Card Type:"]
[null,"Name on Card:",{"$nulls":4},"Zip:"]
[null,"Exp Date:",{"$nulls":4},"CVV:"]
[]
[]
[null,"Description",null,null,"UPC Code","Item Code","Price","MAP","Qty","Total","Summary","INVENTORY UPDATE 1/15/21"]
["Go-In! Colour Series v.4 p.1","Go-In! Pebble Grain Pitch Black",null,null,811685023778,"PGC3778",{"v":31.5,"d":"$31.50"},{"$f":"IF(G33=0,\" \",(G33*2)-0.01)","v":{"v":62.99,"d":"$62.99"}},null,{"$f":"I33*G33","v":{"v":0,"d":"$0.00"}},"Golf","IN STOCK"]
[null,"Go-In! Pebble Grain Cognac",null,null,811685023914,"PGC3914",{"v":31.5,"d":"$31.50"},{"v":62.99,"d":"$62.99"},null,{"v":0,"d":"$0.00"},"Golf","IN STOCK"]
[null,"Go-In! Pebble Grain Deep Sea Navy",null,null,811685023822,"PGC3822",{"v":31.5,"d":"$31.50"},{"v":62.99,"d":"$62.99"},null,{"v":0,"d":"$0.00"},"Golf","IN STOCK"]
[null,"Go-In!PebbleGrainTobacco",null,null,811685023907,"PGC3907",{"v":31.5,"d":"$31.50"},{"$f":"IF(G36=0,\"\",(G36*2)-0.01)","v":{"v":62.99,"d":"$62.99"}},null,{"v":0,"d":"$0.00"},"Golf","INSTOCK"]
[null,"Go-In! Pebble Grain Smoke Grey",null,null,811685024133,"PGC4133",{"v":31.5,"d":"$31.50"},{"v":62.99,"d":"$62.99"},null,{"v":0,"d":"$0.00"},"Golf","IN STOCK"]
[null,"Go-In! Pebble Grain Winner White",null,null,811685024164,"PGC4164",{"v":31.5,"d":"$31.50"},{"v":62.99,"d":"$62.99"},null,{"v":0,"d":"$0.00"},"Golf","IN STOCK"]
["Classic Colour Series p.2","Classic Pebble Grain Pitch Black",null,null,811685024676,"PCC4676",{"v":26.5,"d":"$26.50"},{"$f":"IF(G39=0,\" \",(G39*2)-0.01)","v":{"v":52.99,"d":"$52.99"}},null,{"$f":"I39*G39","v":{"v":0,"d":"$0.00"}},"Classic","LOW INVENTORY",{"$f":"+IFERROR(VLOOKUP(F39,#REF!,2,FALSE),\" \")","v":" "}]
[null," Classic Pebble Grain Cognac",null,null,811685024720,"PCC4720",{"v":26.5,"d":"$26.50"},{"$f":"IF(G40=0,\" \",(G40*2)-0.01)","v":{"v":52.99,"d":"$52.99"}},null,{"v":0,"d":"$0.00"},"Classic","IN STOCK",{"$f":"+IFERROR(VLOOKUP(F40,#REF!,2,FALSE),\" \")","v":" "}]
{"$rows_left_out":269}
{"sheet":"Flag Entry Sheet","index":2,"n_rows":42,"n_cols":25,"rows_kept":42}
[]
[{"$nulls":15},"CODE STRING ANSWER:"]
[null,"Product","Buckle Type","Flag","Strap","Qty","Check",{"$nulls":13},"Description","UPC","Item Code","Price","MSRP"]
[{"$nulls":15},{"$f":"IF(ISBLANK(B4),\"Blank\",B4&\" \"&C4&\" \"&D4&\" \"&E4)","v":"Blank"},{"$nulls":4},{"$f":"IFERROR(VLOOKUP(P4,Data!$A$2:$J$76,6,FALSE),\"#N/A\")","v":"-"},{"$f":"IFERROR(VLOOKUP(P4,Data!$A$2:$J$76,7,FALSE),\"#N/A\")","v":"-"},{"$f":"IFERROR(VLOOKUP(P4,Data!$A$2:$J$76,8,FALSE),\"#N/A\")","v":"-"},{"$f":"IFERROR(VLOOKUP(P4,Data!$A$2:$J$76,9,FALSE),\"#N/A\")","v":0},{"$f":"IFERROR(VLOOKUP(P4,Data!$A$2:$J$76,10,FALSE),\"#N/A\")","v":"-"}]
[{"$nulls":15},{"$f":"IF(ISBLANK(B5),\"Blank\",B5&\" \"&C5&\" \"&D5&\" \"&E5)","v":"Blank"},{"$nulls":4},{"$f":"IFERROR(VLOOKUP(P5,Data!$A$2:$J$76,6,FALSE),\"#N/A\")","v":"-"},{"$f":"IFERROR(VLOOKUP(P5,Data!$A$2:$J$76,7,FALSE),\"#N/A\")","v":"-"},{"$f":"IFERROR(VLOOKUP(P5,Data!$A$2:$J$76,8,FALSE),\"#N/A\")","v":"-"},{"$f":"IFERROR(VLOOKUP(P5,Data!$A$2:$J$76,9,FALSE),\"#N/A\")","v":0},{"$f":"IFERROR(VLOOKUP(P5,Data!$A$2:$J$76,10,FALSE),\"#N/A\")","v":"-"}]
[{"$nulls":6},{"$f":"IF(U6=\"#N/A\",\"Combination Not Available\",\" \")","v":" "},{"$nulls":8},"Blank",{"$nulls":4},{"$f":"IFERROR(VLOOKUP(P6,Data!$A$2:$J$76,6,FALSE),\"#N/A\")","v":"-"},{"$f":"IFERROR(VLOOKUP(P6,Data!$A$2:$J$76,7,FALSE),\"#N/A\")","v":"-"},{"$f":"IFERROR(VLOOKUP(P6,Data!$A$2:$J$76,8,FALSE),\"#N/A\")","v":"-"},{"$f":"IFERROR(VLOOKUP(P6,Data!$A$2:$J$76,9,FALSE),\"#N/A\")","v":0},{"$f":"IFERROR(VLOOKUP(P6,Data!$A$2:$J$76,10,FALSE),\"#N/A\")","v":"-"}]
[{"$nulls":6}," ",{"$nulls":8},"Blank",{"$nulls":4},{"$f":"IFERROR(VLOOKUP(P7,Data!$A$2:$J$76,6,FALSE),\"#N/A\")","v":"-"},{"$f":"IFERROR(VLOOKUP(P7,Data!$A$2:$J$76,7,FALSE),\"#N/A\")","v":"-"},{"$f":"IFERROR(VLOOKUP(P7,Data!$A$2:$J$76,8,FALSE),\"#N/A\")","v":"-"},{"$f":"IFERROR(VLOOKUP(P7,Data!$A$2:$J$76,9,FALSE),\"#N/A\")","v":0},{"$f":"IFERROR(VLOOKUP(P7,Data!$A$2:$J$76,10,FALSE),\"#N/A\")","v":"-"}]
[{"$nulls":6}," ",{"$nulls":8},"Blank",{"$nulls":4},{"$f":"IFERROR(VLOOKUP(P8,Data!$A$2:$J$76,6,FALSE),\"#N/A\")","v":"-"},{"$f":"IFERROR(VLOOKUP(P8,Data!$A$2:$J$76,7,FALSE),\"#N/A\")","v":"-"},{"$f":"IFERROR(VLOOKUP(P8,Data!$A$2:$J$76,8,FALSE),\"#N/A\")","v":"-"},{"$f":"IFERROR(VLOOKUP(P8,Data!$A$2:$J$76,9,FALSE),\"#N/A\")","v":0},{"$f":"IFERROR(VLOOKUP(P8,Data!$A$2:$J$76,10,FALSE),\"#N/A\")","v":"-"}]
[{"$nulls":6}," ",{"$nulls":8},"Blank",{"$nulls":4},{"$f":"IFERROR(VLOOKUP(P9,Data!$A$2:$J$76,6,FALSE),\"#N/A\")","v":"-"},{"$f":"IFERROR(VLOOKUP(P9,Data!$A$2:$J$76,7,FALSE),\"#N/A\")","v":"-"},{"$f":"IFERROR(VLOOKUP(P9,Data!$A$2:$J$76,8,FALSE),\"#N/A\")","v":"-"},{"$f":"IFERROR(VLOOKUP(P9,Data!$A$2:$J$76,9,FALSE),\"#N/A\")","v":0},{"$f":"IFERROR(VLOOKUP(P9,Data!$A$2:$J$76,10,FALSE),\"#N/A\")","v":"-"}]
[{"$nulls":6}," ",{"$nulls":8},"Blank",{"$nulls":4},{"$f":"IFERROR(VLOOKUP(P10,Data!$A$2:$J$76,6,FALSE),\"#N/A\")","v":"-"},{"$f":"IFERROR(VLOOKUP(P10,Data!$A$2:$J$76,7,FALSE),\"#N/A\")","v":"-"},{"$f":"IFERROR(VLOOKUP(P10,Data!$A$2:$J$76,8,FALSE),\"#N/A\")","v":"-"},{"$f":"IFERROR(VLOOKUP(P10,Data!$A$2:$J$76,9,FALSE),\"#N/A\")","v":0},{"$f":"IFERROR(VLOOKUP(P10,Data!$A$2:$J$76,10,FALSE),\"#N/A\")","v":"-"}]
[{"$nulls":6}," ",{"$nulls":8},"Blank",{"$nulls":4},{"$f":"IFERROR(VLOOKUP(P11,Data!$A$2:$J$76,6,FALSE),\"#N/A\")","v":"-"},{"$f":"IFERROR(VLOOKUP(P11,Data!$A$2:$J$76,7,FALSE),\"#N/A\")","v":"-"},{"$f":"IFERROR(VLOOKUP(P11,Data!$A$2:$J$76,8,FALSE),\"#N/A\")","v":"-"},{"$f":"IFERROR(VLOOKUP(P11,Data!$A$2:$J$76,9,FALSE),\"#N/A\")","v":0},{"$f":"IFERROR(VLOOKUP(P11,Data!$A$2:$J$76,10,FALSE),\"#N/A\")","v":"-"}]
[{"$nulls":6}," ",{"$nulls":8},"Blank",{"$nulls":4},{"$f":"IFERROR(VLOOKUP(P12,Data!$A$2:$J$76,6,FALSE),\"#N/A\")","v":"-"},{"$f":"IFERROR(VLOOKUP(P12,Data!$A$2:$J$76,7,FALSE),\"#N/A\")","v":"-"},{"$f":"IFERROR(VLOOKUP(P12,Data!$A$2:$J$76,8,FALSE),\"#N/A\")","v":"-"},{"$f":"IFERROR(VLOOKUP(P12,Data!$A$2:$J$76,9,FALSE),\"#N/A\")","v":0},{"$f":"IFERROR(VLOOKUP(P12,Data!$A$2:$J$76,10,FALSE),\"#N/A\")","v":"-"}]
[{"$nulls":6}," ",{"$nulls":8},"Blank",{"$nulls":4},{"$f":"IFERROR(VLOOKUP(P13,Data!$A$2:$J$76,6,FALSE),\"#N/A\")","v":"-"},{"$f":"IFERROR(VLOOKUP(P13,Data!$A$2:$J$76,7,FALSE),\"#N/A\")","v":"-"},{"$f":"IFERROR(VLOOKUP(P13,Data!$A$2:$J$76,8,FALSE),\"#N/A\")","v":"-"},{"$f":"IFERROR(VLOOKUP(P13,Data!$A$2:$J$76,9,FALSE),\"#N/A\")","v":0},{"$f":"IFERROR(VLOOKUP(P13,Data!$A$2:$J$76,10,FALSE),\"#N/A\")","v":"-"}]
[null,"Product List","Buckle List ","Flag List ","Strap List ",{"$nulls":10},{"$f":"(B14&\" \"&C14&\" \"&D14&\" \"&E14)","v":"Product List Buckle List  Flag List  Strap List "}]
[null,"Package","Go-In!","Australia","Smooth Black",{"$nulls":10},"Package Go-In! Australia Smooth Black"]
[null,"Buckle Only","Classic","Canada","Smooth White",{"$nulls":10},"Buckle Only Classic Canada Smooth White"]
[{"$nulls":3},"Canada - Black Series","Walnut",{"$nulls":10},"  Canada - Black Series Walnut"]
[{"$nulls":3},"Great Britain",{"$nulls":11},"  Great Britain "]
[{"$nulls":3},"Great Britain - Black Series",{"$nulls":11},"  Great Britain - Black Series "]
[{"$nulls":3},"Ireland",{"$nulls":11},"  Ireland "]
[{"$nulls":3},"Italy",{"$nulls":11},"  Italy "]
[{"$nulls":3},"Mexico",{"$nulls":11},"  Mexico "]
[{"$nulls":3},"Scotland",{"$nulls":11},"  Scotland "]
[{"$nulls":3},"Texas",{"$nulls":11},"  Texas "]
[{"$nulls":3},"Texas - Black Series",{"$nulls":11},"  Texas - Black Series "]
[{"$nulls":3},"Texas - Aston Pewter",{"$nulls":11},"  Texas - Aston Pewter "]
[{"$nulls":3},"USA",{"$nulls":11},"  USA "]
[{"$nulls":3},"USA - Black Series",{"$nulls":11},"  USA - Black Series "]
[{"$nulls":15},"   "]
[{"$nulls":15},"   "]
[{"$nulls":15},"   "]
[{"$nulls":15},"   "]
[{"$nulls":15},"   "]
[{"$nulls":15},"   "]
[{"$nulls":15},"   "]
[{"$nulls":15},"   "]
[{"$nulls":15},"   "]
[{"$nulls":15},"   "]
[{"$nulls":15},"   "]
[null,"ABOVE SELECTIONS CREATE A UNIQUE STRING OF CHARACTERS THAT CAN MATCH AN IDENTICAL STRING OIN THE DATA PAGE",{"$nulls":13},"ABOVE SELECTIONS CREATE A UNIQUE STRING OF CHARACTERS THAT CAN MATCH AN IDENTICAL STRING OIN THE DATA PAGE   "]
{"$rows_left_out":3}
{"sheet":"Rowland Thomas Entry Sheet","index":3,"n_rows":11,"n_cols":9,"rows_kept":11,"merged":[[3,0,10,0]]}
[]
[null,"Order Details:"]
[null,"Description","UPC Code","Item Code","Price","MSRP","Qty","Total","Summary"]
["Rowland Thomas","USA Premium Rowland Thomas Serpent Black/Taupe (Cut to size, up to 45\")",818172022993,"PCU7073",{"v":115,"d":"$115.00"},{"v":230,"d":"$230.00"},null,{"$f":"G4*E4","v":{"v":0,"d":"$0.00"}},"Add'tl"]
[null,"USA Premium Rowland Thomas Serpent Black/Grey (Cut to size, up to 45\")",818172022993,"PCU7066",{"v":115,"d":"$115.00"},{"v":230,"d":"$230.00"},null,{"$f":"G5*E5","v":{"v":0,"d":"$0.00"}},"Add'tl"]
[null,"USA Premium Rowland Thomas Brown Kayiman (Cut to size, up to 45\")",818172022955,"PCU7080",{"v":100,"d":"$100.00"},{"v":200,"d":"$200.00"},null,{"$f":"G6*E6","v":{"v":0,"d":"$0.00"}},"Add'tl"]
[null,"USA Premium Rowland Thomas Black/Blue Kayiman (Cut to size, up to 45\")",818172022962,"PCU7103",{"v":100,"d":"$100.00"},{"v":200,"d":"$200.00"},null,{"v":0,"d":"$0.00"},"Add'tl"]
[null,"USA Premium Rowland Thomas Herrington Brown (Cut to size, up to 45\")",818172022979,"PCU7097",{"v":90,"d":"$90.00"},{"v":180,"d":"$180.00"},null,{"v":0,"d":"$0.00"},"Add'tl"]
[null,"USA Premium Rowland Thomas Herrington Black (Cut to size, up to 45\")",818172022986,"PCU7110",{"v":90,"d":"$90.00"},{"v":180,"d":"$180.00"},null,{"v":0,"d":"$0.00"},"Add'tl"]
[null,"USA Premium Rowland Thomas Chordata Grey (Cut to size, up to 45\")",818172027899,"PCU7899",{"v":100,"d":"$100.00"},{"v":200,"d":"$200.00"},null,{"v":0,"d":"$0.00"},"Add'tl"]
[null,"USA Premium Rowland Thomas Chordata Brown (Cut to size, up to 45\")",818172027912,"PCU7912",{"v":100,"d":"$100.00"},{"v":200,"d":"$200.00"},null,{"v":0,"d":"$0.00"},"Add'tl"]

{"sheet":"Data","index":4,"n_rows":76,"n_cols":12,"rows_kept":76,"hidden":true}
["Code String","Product","Buckle Type","Flag","Strap","Description","UPC","Item Code","Price","MSRP","Qty","Total"]
[{"$f":"(B2&\" \"&C2&\" \"&D2&\" \"&E2)","v":"Buckle Only Go-In! USA "},"Buckle Only","Go-In!","USA",null,"Go-In! Heritage USA Buckle","811685021071","BGH1071",{"v":11,"d":"$11.00"},{"v":21.99,"d":"$21.99"},null,{"$f":"K2*I2","v":{"v":0,"d":"$0.00"}}]
[{"$f":"(B3&\" \"&C3&\" \"&D3&\" \"&E3)","v":"Buckle Only Go-In! Canada "},"Buckle Only","Go-In!","Canada",null,"Go-In! Heritage Canada Buckle","811685021088","BGH1088",{"v":11,"d":"$11.00"},{"v":21.99,"d":"$21.99"},null,{"$f":"K3*I3","v":{"v":0,"d":"$0.00"}}]
["Buckle Only Go-In! Italy ","Buckle Only","Go-In!","Italy",null,"Go-In! Heritage Italy Buckle","811685023969","BGH3969",{"v":11,"d":"$11.00"},{"v":21.99,"d":"$21.99"},null,{"v":0,"d":"$0.00"}]
["Buckle Only Go-In! Ireland ","Buckle Only","Go-In!","Ireland",null,"Go-In! Heritage Ireland Buckle","811685024331","BGH4331",{"v":11,"d":"$11.00"},{"v":21.99,"d":"$21.99"},null,{"v":0,"d":"$0.00"}]
["Buckle Only Go-In! Great Britain ","Buckle Only","Go-In!","Great Britain",null,"Go-In! Heritage Great Britain Buckle","811685024348","BGH4348",{"v":11,"d":"$11.00"},{"v":21.99,"d":"$21.99"},null,{"v":0,"d":"$0.00"}]
["Buckle Only Go-In! Texas ","Buckle Only","Go-In!","Texas",null,"Go-In! Heritage Texas Buckle","811685024423","BGH4423",{"v":11,"d":"$11.00"},{"v":21.99,"d":"$21.99"},null,{"v":0,"d":"$0.00"}]
["Buckle Only Go-In! Scotland ","Buckle Only","Go-In!","Scotland",null,"Go-In! Heritage Scotland Buckle","811685024577","BGH4577",{"v":11,"d":"$11.00"},{"v":21.99,"d":"$21.99"},null,{"v":0,"d":"$0.00"}]
["Buckle Only Go-In! USA - Black Series ","Buckle Only","Go-In!","USA - Black Series",null,"Go-In! Black Series USA Buckle","811685025017","BGB5017",{"v":11,"d":"$11.00"},{"v":21.99,"d":"$21.99"},null,{"v":0,"d":"$0.00"}]
["Buckle Only Go-In! Great Britain - Black Series ","Buckle Only","Go-In!","Great Britain - Black Series",null,"Go-In! Black Series Great Britain Buckle","811685025086","BGB5086",{"v":11,"d":"$11.00"},{"v":21.99,"d":"$21.99"},null,{"v":0,"d":"$0.00"}]
["Buckle Only Go-In! Texas - Black Series ","Buckle Only","Go-In!","Texas - Black Series",null,"Go-In! Black Series Texas Buckle","811685025185","BGB5185",{"v":11,"d":"$11.00"},{"v":21.99,"d":"$21.99"},null,{"v":0,"d":"$0.00"}]
["Buckle Only Go-In! Canada - Black Series ","Buckle Only","Go-In!","Canada - Black Series",null,"Go-In! Black Series Canada Buckle","811685025628","BGB5628",{"v":11,"d":"$11.00"},{"v":21.99,"d":"$21.99"},null,{"v":0,"d":"$0.00"}]
["Buckle Only Go-In! Australia ","Buckle Only","Go-In!","Australia",null,"Go-In! Heritage Australia Buckle","811685024393","BGH4393",{"v":11,"d":"$11.00"},{"v":21.99,"d":"$21.99"},null,{"v":0,"d":"$0.00"}]
["Buckle Only Go-In! Mexico ","Buckle Only","Go-In!","Mexico",null,"Go-In! Heritage Mexico Buckle","811685021095","BGH1095",{"v":11,"d":"$11.00"},{"v":21.99,"d":"$21.99"},null,{"v":0,"d":"$0.00"}]
["Buckle Only Classic USA ","Buckle Only","Classic","USA",null,"Classic Heritage USA Buckle","811685021613","BCH1613",{"v":10,"d":"$10.00"},{"v":19.99,"d":"$19.99"},null,{"v":0,"d":"$0.00"}]
["Buckle Only Classic Italy ","Buckle Only","Classic","Italy",null,"Classic Heritage Italy Buckle","811685025345","BCH5345",{"v":10,"d":"$10.00"},{"v":19.99,"d":"$19.99"},null,{"v":0,"d":"$0.00"}]
["Buckle Only Classic Ireland ","Buckle Only","Classic","Ireland",null,"Classic Heritage Ireland Buckle","811685025369","BCH5369",{"v":10,"d":"$10.00"},{"v":19.99,"d":"$19.99"},null,{"v":0,"d":"$0.00"}]
["Buckle Only Classic Canada ","Buckle Only","Classic","Canada",null,"Classic Heritage Canada Buckle","811685025697","BCH5697",{"v":10,"d":"$10.00"},{"v":19.99,"d":"$19.99"},null,{"v":0,"d":"$0.00"}]
["Buckle Only Classic Great Britain ","Buckle Only","Classic","Great Britain",null,"Classic Heritage Great Britain Buckle","811685027561","BCH7561",{"v":10,"d":"$10.00"},{"v":19.99,"d":"$19.99"},null,{"v":0,"d":"$0.00"}]
["Buckle Only Classic Texas ","Buckle Only","Classic","Texas",null,"Classic Heritage Texas Buckle","811685027653","BCH7653",{"v":10,"d":"$10.00"},{"v":19.99,"d":"$19.99"},null,{"v":0,"d":"$0.00"}]
["Buckle Only Classic USA - Black Series ","Buckle Only","Classic","USA - Black Series",null,"Classic Black Series USA Buckle","811685024980","BCB4980",{"v":10,"d":"$10.00"},{"v":19.99,"d":"$19.99"},null,{"v":0,"d":"$0.00"}]
["Buckle Only Classic Texas - Black Series ","Buckle Only","Classic","Texas - Black Series",null,"Classic Black Series Texas Buckle","811685025444","BCB5444",{"v":10,"d":"$10.00"},{"v":19.99,"d":"$19.99"},null,{"v":0,"d":"$0.00"}]
["Buckle Only Classic Texas - Aston Pewter ","Buckle Only","Classic","Texas - Aston Pewter",null,"Classic Aston Pewter Texas Buckle",811685028049,"BCH8049",{"v":12.5,"d":"$12.50"},{"v":24.99,"d":"$24.99"},null,{"v":0,"d":"$0.00"}]
["Buckle Only Classic Great Britain - Black Series ","Buckle Only","Classic","Great Britain - Black Series",null,"Classic Black Series Great Britain Buckle","811685025451","BCB5451",{"v":10,"d":"$10.00"},{"v":19.99,"d":"$19.99"},null,{"v":0,"d":"$0.00"}]
["Buckle Only Classic Canada - Black Series ","Buckle Only","Classic","Canada - Black Series",null,"Classic Black Series Canada Buckle","811685025482","BCB5482",{"v":10,"d":"$10.00"},{"v":19.99,"d":"$19.99"},null,{"v":0,"d":"$0.00"}]
["Buckle Only Classic Australia ","Buckle Only","Classic","Australia",null,"Classic Heritage Australia Buckle","818172020760","BCH0760",{"v":10,"d":"$10.00"},{"v":19.99,"d":"$19.99"},null,{"v":0,"d":"$0.00"}]
["Buckle Only Classic Mexico ","Buckle Only","Classic","Mexico",null,"Classic Heritage Mexico Buckle","818172020753","BCH0753",{"v":10,"d":"$10.00"},{"v":19.99,"d":"$19.99"},null,{"v":0,"d":"$0.00"}]
["Buckle Only Classic Scotland ","Buckle Only","Classic","Scotland",null,"Classic Heritage Scotland Buckle",818172020821,"BCH0821",{"v":10,"d":"$10.00"},{"v":19.99,"d":"$19.99"},null,{"v":0,"d":"$0.00"}]
["Package Go-In! Australia Smooth White","Package","Go-In!","Australia","Smooth White","Go-In! Heritage Australia White Strap","811685022030","PGH2030",{"v":30,"d":"$30.00"},{"v":59.99,"d":"$59.99"},null,{"v":0,"d":"$0.00"}]
["Package Go-In! Australia Smooth Black","Package","Go-In!","Australia","Smooth Black","Go-In! Heritage Australia Black Strap","811685022825","PGH2825",{"v":30,"d":"$30.00"},{"v":59.99,"d":"$59.99"},null,{"v":0,"d":"$0.00"}]
["Package Go-In! Great Britain Smooth White","Package","Go-In!","Great Britain","Smooth White","Go-In! Heritage Great Britain White Strap","811685022047","PGH2047",{"v":30,"d":"$30.00"},{"v":59.99,"d":"$59.99"},null,{"v":0,"d":"$0.00"}]
["Package Go-In! Great Britain Smooth Black","Package","Go-In!","Great Britain","Smooth Black","Go-In! Heritage Great Britain Black Strap","811685022917","PGH2917",{"v":30,"d":"$30.00"},{"v":59.99,"d":"$59.99"},null,{"v":0,"d":"$0.00"}]
["Package Go-In! Canada Smooth White","Package","Go-In!","Canada","Smooth White","Go-In! Heritage Canada White Strap","811685022054","PGH2054",{"v":30,"d":"$30.00"},{"v":59.99,"d":"$59.99"},null,{"v":0,"d":"$0.00"}]
["Package Go-In! Canada Smooth Black","Package","Go-In!","Canada","Smooth Black","Go-In! Heritage Canada Black Strap","811685022771","PGH2771",{"v":30,"d":"$30.00"},{"v":59.99,"d":"$59.99"},null,{"v":0,"d":"$0.00"}]
["Package Go-In! USA Smooth White","Package","Go-In!","USA","Smooth White","Go-In! Heritage USA White Strap","811685022115","PGH2115",{"v":30,"d":"$30.00"},{"v":59.99,"d":"$59.99"},null,{"v":0,"d":"$0.00"}]
["Package Go-In! USA Smooth Black","Package","Go-In!","USA","Smooth Black","Go-In! Heritage USA Black Strap","811685022733","PGH2733",{"v":30,"d":"$30.00"},{"v":59.99,"d":"$59.99"},null,{"v":0,"d":"$0.00"}]
["Package Go-In! Italy Smooth White","Package","Go-In!","Italy","Smooth White","Go-In! Heritage Italy White Strap","811685023013","PGH3013",{"v":30,"d":"$30.00"},{"v":59.99,"d":"$59.99"},null,{"v":0,"d":"$0.00"}]
["Package Go-In! Italy Smooth Black","Package","Go-In!","Italy","Smooth Black","Go-In! Heritage Italy Black Strap","811685022726","PGH2726",{"v":30,"d":"$30.00"},{"v":59.99,"d":"$59.99"},null,{"v":0,"d":"$0.00"}]
["Package Go-In! Scotland Smooth White","Package","Go-In!","Scotland","Smooth White","Go-In! Heritage Scotland White Strap","811685023037","PGH3037",{"v":30,"d":"$30.00"},{"v":59.99,"d":"$59.99"},null,{"v":0,"d":"$0.00"}]
["Package Go-In! Scotland Smooth Black","Package","Go-In!","Scotland","Smooth Black","Go-In! Heritage Scotland Black Strap","811685022757","PGH2757",{"v":30,"d":"$30.00"},{"v":59.99,"d":"$59.99"},null,{"v":0,"d":"$0.00"}]
{"$rows_left_out":36}